{"text_format":"1","workbook":"xlsx","n_sheets":4,"sheets":["Varsity","Scores","JV","Sheet1"],"not_rendered":{"charts":0,"images":0,"macros":1,"external_links":0,"defined_names":3,"comments":0,"pivot_tables":0},"unopened":[],"bounds":{"document_bytes":16777216,"sheet_cells":100000,"rows_first":2000,"rows_last":500,"rows_between":2000,"halvings":0,"cell_chars":16384,"cell_head_chars":4096},"cells_cut":0,"cells_raw":0,"read":"whole","date_system":"1904"}

{"sheet":"Varsity","index":0,"n_rows":24,"n_cols":7,"rows_kept":24,"cut":false,"hidden":false,"merged":[[10,2,11,2],[10,3,11,3],[10,4,11,4],[10,1,11,1],[10,0,11,0],[5,1,5,3],[6,1,6,3],[0,0,0,3],[0,5,0,6],[2,1,2,3],[1,5,1,6],[4,4,4,6],[2,4,2,6]]}
["Fox Valley Association",null,null,null,null,"Varsity"]
[]
["Match Date:",{"$f":"IF(Scores!B5=\"\",\"Please enter date on 'Scores' page.\",Scores!B5)","v":"2023-09-08"},null,null,{"$f":"IF(Scores!B5=\"\",\"Report Date:\",CONCATENATE(\"Report Date: \",TEXT(Scores!B5,\"m/d/yyyy\")))","v":"Report Date: 9/8/2023"}]
[]
[null,null,null,null,"     Team Score"]
["School Reporting:",{"$f":"Scores!B10","v":"Hortonville"},null,null,"----->",{"$f":"Scores!K17","v":203}," "]
["Opponent:",{"$f":"Scores!N10","v":"Neenah"},null,null,"----->",{"$f":"Scores!W17","v":184}," "]
[]
["E-Mail this form to: webmaster@fvaathletics.org as an attachment",null,null,null,null,null,{"$f":"IF(F9=\"\",\"\",IF(COUNTIF(Scores!$A$11:$A$18,Varsity!F9)>0,Scores!$B$10,Scores!$N$10))","v":""}]
[]
["Name (First Last)","School","9 Hole\nScore","Position\nFinish Points","Opponents\nBeaten"]
[]
["Aubrey Oitzinger",{"$f":"IF(A13=\"\",\"\",IF(COUNTIF(Scores!$A$11:$A$18,Varsity!A13)>0,Scores!$B$10,Scores!$N$10))","v":"Neenah"},42,{"$f":"IF(C13=\"\",\"\",IF(C13<>C14,F13,SUM(OFFSET(F13,0,0,COUNTIF(C13:C24,C13),1))/COUNTIF(C13:C24,C13)))","v":12},{"$f":"IF(C13>0,SUM(COUNTIFS($B$13:$B$24,\"<>\"&B13,$C$13:$C$24,\">\"&C13)+(0.5*SUM(COUNTIFS($B$13:$B$24,\"<>\"&B13,$C$13:$C$24,C13)))),\"\")","v":6},12]
["Maci McNichols",{"$f":"IF(A14=\"\",\"\",IF(COUNTIF(Scores!$A$11:$A$18,Varsity!A14)>0,Scores!$B$10,Scores!$N$10))","v":"Hortonville"},45,{"$f":"IF(C14=\"\",\"\",IF(C14=C13,D13,IF(C14<>C15,F14,SUM(OFFSET(F14,0,0,COUNTIF(C14:C$24,C14),1))/COUNTIF(C14:C$24,C14))))","v":10.5},{"$f":"IF(C14>0,SUM(COUNTIFS($B$13:$B$24,\"<>\"&B14,$C$13:$C$24,\">\"&C14)+(0.5*SUM(COUNTIFS($B$13:$B$24,\"<>\"&B14,$C$13:$C$24,C14)))),\"\")","v":4.5},11]
["Annika Searles",{"$f":"IF(A15=\"\",\"\",IF(COUNTIF(Scores!$A$11:$A$18,Varsity!A15)>0,Scores!$B$10,Scores!$N$10))","v":"Neenah"},45,{"$f":"IF(C15=\"\",\"\",IF(C15=C14,D14,IF(C15<>C16,F15,SUM(OFFSET(F15,0,0,COUNTIF(C15:C$24,C15),1))/COUNTIF(C15:C$24,C15))))","v":10.5},5.5,10]
["Lauren Aaholm",{"$f":"IF(A16=\"\",\"\",IF(COUNTIF(Scores!$A$11:$A$18,Varsity!A16)>0,Scores!$B$10,Scores!$N$10))","v":"Neenah"},47,{"$f":"IF(C16=\"\",\"\",IF(C16=C15,D15,IF(C16<>C17,F16,SUM(OFFSET(F16,0,0,COUNTIF(C16:C$24,C16),1))/COUNTIF(C16:C$24,C16))))","v":9},5,9]
["Natalie Quella",{"$f":"IF(A17=\"\",\"\",IF(COUNTIF(Scores!$A$11:$A$18,Varsity!A17)>0,Scores!$B$10,Scores!$N$10))","v":"Neenah"},50,{"$f":"IF(C17=\"\",\"\",IF(C17=C16,D16,IF(C17<>C18,F17,SUM(OFFSET(F17,0,0,COUNTIF(C17:C$24,C17),1))/COUNTIF(C17:C$24,C17))))","v":8},5,8]
["Annabelle Hodges",{"$f":"IF(A18=\"\",\"\",IF(COUNTIF(Scores!$A$11:$A$18,Varsity!A18)>0,Scores!$B$10,Scores!$N$10))","v":"Neenah"},51,{"$f":"IF(C18=\"\",\"\",IF(C18=C17,D17,IF(C18<>C19,F18,SUM(OFFSET(F18,0,0,COUNTIF(C18:C$24,C18),1))/COUNTIF(C18:C$24,C18))))","v":7},5,7]
["Leah Heraly",{"$f":"IF(A19=\"\",\"\",IF(COUNTIF(Scores!$A$11:$A$18,Varsity!A19)>0,Scores!$B$10,Scores!$N$10))","v":"Hortonville"},52,{"$f":"IF(C19=\"\",\"\",IF(C19=C18,D18,IF(C19<>C20,F19,SUM(OFFSET(F19,0,0,COUNTIF(C19:C$24,C19),1))/COUNTIF(C19:C$24,C19))))","v":6},1,6]
["Cassie Cruz",{"$f":"IF(A20=\"\",\"\",IF(COUNTIF(Scores!$A$11:$A$18,Varsity!A20)>0,Scores!$B$10,Scores!$N$10))","v":"Hortonville"},53,{"$f":"IF(C20=\"\",\"\",IF(C20=C19,D19,IF(C20<>C21,F20,SUM(OFFSET(F20,0,0,COUNTIF(C20:C$24,C20),1))/COUNTIF(C20:C$24,C20))))","v":4.5},1,5]
["Olivia Kernen",{"$f":"IF(A21=\"\",\"\",IF(COUNTIF(Scores!$A$11:$A$18,Varsity!A21)>0,Scores!$B$10,Scores!$N$10))","v":"Hortonville"},53,{"$f":"IF(C21=\"\",\"\",IF(C21=C20,D20,IF(C21<>C22,F21,SUM(OFFSET(F21,0,0,COUNTIF(C21:C$24,C21),1))/COUNTIF(C21:C$24,C21))))","v":4.5},1,4]
["Hailey Cummings",{"$f":"IF(A22=\"\",\"\",IF(COUNTIF(Scores!$A$11:$A$18,Varsity!A22)>0,Scores!$B$10,Scores!$N$10))","v":"Hortonville"},54,{"$f":"IF(C22=\"\",\"\",IF(C22=C21,D21,IF(C22<>C23,F22,SUM(OFFSET(F22,0,0,COUNTIF(C22:C$24,C22),1))/COUNTIF(C22:C$24,C22))))","v":2.5},1,3]
["Taylor Lillge",{"$f":"IF(A23=\"\",\"\",IF(COUNTIF(Scores!$A$11:$A$18,Varsity!A23)>0,Scores!$B$10,Scores!$N$10))","v":"Hortonville"},54,{"$f":"IF(C23=\"\",\"\",IF(C23=C22,D22,IF(C23<>C24,F23,SUM(OFFSET(F23,0,0,COUNTIF(C23:C$24,C23),1))/COUNTIF(C23:C$24,C23))))","v":2.5},1,2]
["Rhyan Brockman",{"$f":"IF(A24=\"\",\"\",IF(COUNTIF(Scores!$A$11:$A$18,Varsity!A24)>0,Scores!$B$10,Scores!$N$10))","v":"Neenah"},60,{"$f":"IF(C24=\"\",\"\",IF(C24=C23,D23,IF(C24<>C25,F24,SUM(OFFSET(F24,0,0,COUNTIF(C24:C$24,C24),1))/COUNTIF(C24:C$24,C24))))","v":1},0,1]

{"sheet":"Scores","index":1,"n_rows":24,"n_cols":24,"rows_kept":24,"cut":false,"hidden":false,"merged":[[4,6,4,10],[0,12,2,12],[3,12,5,12],[9,1,9,8],[9,13,9,20],[0,1,0,10],[1,1,1,10],[2,1,2,10],[3,1,3,10],[0,13,0,22],[1,13,1,22],[2,13,2,22],[3,13,3,22],[4,13,4,22],[5,13,5,22],[4,1,4,5],[5,0,5,10]]}
["HOME TEAM:","Hortonville",null,null,null,null,null,null,null,null,null,null,"COMMENTS:"]
["AWAY TEAM:","Neenah"]
[]
["COACHES:","Bauer/ Hendrickson",null,null,null,null,null,null,null,null,null,null,"CONDITIONS:"]
["DATE/SITE:","2023-09-08"]
["(Hint: Use \"CTRL + ;\" to insert today's date.)"]
["Holes:",1,2,3,4,5,6,7,8,9,null,null,"Holes:",10,11,12,13,14,15,16,17,18]
["Par:",4,4,4,3,4,4,4,3,5,{"$f":"SUM(B8:J8)","v":35},null,"Par:",null,null,null,null,null,null,null,null,null,{"$f":"SUM(N8:V8)","v":0}]
[]
["TEAM: ",{"$f":"IF(B1=\"\",\"Home\",B1)","v":"Hortonville"},null,null,null,null,null,null,null,null,"TOTAL",null,"TEAM: ",{"$f":"IF(B2=\"\",\"Away\",B2)","v":"Neenah"},null,null,null,null,null,null,null,null,"TOTAL"]
["Maci McNichols",5,6,5,4,4,6,5,4,6,{"$f":"SUM(B11:J11)","v":45},{"$f":"RANK(K11,$K$11:$K$16,1)","v":1},"Natalie Quella",5,6,4,6,6,5,6,4,8,{"$f":"SUM(N11:V11)","v":50},{"$f":"RANK(W11,$W$11:$W$16,1)","v":4}]
["Leah Heraly",6,10,6,3,4,6,6,4,7,52,{"$f":"RANK(K12,$K$11:$K$16,1)","v":2},"Aubrey Oitzinger",4,6,5,3,5,5,5,3,6,42,{"$f":"RANK(W12,$W$11:$W$16,1)","v":1}]
["Cassie Cruz",6,5,7,8,5,6,6,4,6,53,3,"Annika Searles",6,5,4,5,5,5,6,4,5,45,2]
["Olivia Kernen",6,7,5,5,6,7,6,4,7,53,3,"Annabelle Hodges",4,7,7,4,6,6,6,4,7,51,5]
["Hailey Cummings",5,6,6,3,8,7,6,5,8,54,5,"Lauren Aaholm",6,6,5,4,5,5,4,4,8,47,3]
["Taylor Lillge",5,6,6,4,9,7,6,4,7,54,5,"Rhyan Brockman",7,7,8,6,5,7,8,6,6,60,6]
[null,null,null,null,null,null,null,null,null,null,{"$f":"IF(AND(COUNTIF(L11:L16,\"<5\")>=4,(COUNTIF(L11:L16,\"4\")>1)),SUMIF(L11:L16,\"<4\",K11:K16)+(SUMIF(L11:L16,\"=4\",K11:K16)/(COUNTIF(L11:L16,\"4\"))*1),\nIF(AND(COUNTIF(L11:L16,\"<5\")>=4,(COUNTIF(L11:L16,\"3\")>1)),SUMIF(L11:L16,\"<3\",K11:K16)+(SUMIF(L11:L16,\"=3\",K11:K16)/(COUNTIF(L11:L16,\"3\"))*2),\nIF(AND(COUNTIF(L11:L16,\"<5\")>=4,(COUNTIF(L11:L16,\"2\")>2)),SUMIF(L11:L16,\"<2\",K11:K16)+(SUMIF(L11:L16,\"=2\",K11:K16)/(COUNTIF(L11:L16,\"2\"))*3),\nIF(COUNTIF(L11:L16,\"=1\")>=4,((SUMIF(L11:L16,\"=1\",K11:K16)/COUNTIF(L11:L16,\"1\"))*4),\nIF(COUNTIF(L11:L16,\"<5\")=4,SUMIF(L11:L16,\"<5\",K11:K16))))))","v":203},null,null,null,null,null,null,null,null,null,null,null,{"$f":"IF(AND(COUNTIF(X11:X16,\"<5\")>=4,(COUNTIF(X11:X16,\"4\")>1)),SUMIF(X11:X16,\"<4\",W11:W16)+(SUMIF(X11:X16,\"=4\",W11:W16)/(COUNTIF(X11:X16,\"4\"))*1),\nIF(AND(COUNTIF(X11:X16,\"<5\")>=4,(COUNTIF(X11:X16,\"3\")>1)),SUMIF(X11:X16,\"<3\",W11:W16)+(SUMIF(X11:X16,\"=3\",W11:W16)/(COUNTIF(X11:X16,\"3\"))*2),\nIF(AND(COUNTIF(X11:X16,\"<5\")>=4,(COUNTIF(X11:X16,\"2\")>2)),SUMIF(X11:X16,\"<2\",W11:W16)+(SUMIF(X11:X16,\"=2\",W11:W16)/(COUNTIF(X11:X16,\"2\"))*3),\nIF(COUNTIF(X11:X16,\"=1\")>=4,((SUMIF(X11:X16,\"=1\",W11:W16)/COUNTIF(X11:X16,\"1\"))*4),\nIF(COUNTIF(X11:X16,\"<5\")=4,SUMIF(X11:X16,\"<5\",W11:W16))))))","v":184}]
["Brooklyn Danke",7,9,6,5,6,8,7,4,8,{"$f":"SUM(B18:J18)","v":60},{"$f":"RANK(K18,$K$18:$K$23,1)","v":5},"Ava Drach",7,7,4,6,7,7,5,5,8,{"$f":"SUM(N18:V18)","v":56},{"$f":"RANK(W18,$W$18:$W$23,1)","v":3}]
["Emily Derby",5,7,7,5,8,7,6,6,7,58,{"$f":"RANK(K19,$K$18:$K$23,1)","v":4},"Jordyn Brockman",4,6,5,6,7,6,6,4,8,{"$f":"SUM(N19:V19)","v":52},1]
["Paige Clausen",6,6,6,6,7,8,5,4,8,56,3,"Lilly Quella",4,8,9,6,4,6,5,5,7,54,2]
["Camryn Breaker",7,9,6,5,9,8,9,4,8,65,6,"Adranne Oitzinger",8,7,6,8,6,8,8,5,7,63,4]
["Sydney Jones",8,6,5,5,6,7,5,5,5,52,1,"JV 11",9,9,9,9,9,9,9,9,9,81,5]
["Tia Diamond",6,7,7,5,6,6,7,4,6,54,2,"JV 12",9,9,9,9,9,9,9,9,9,81,5]
[null,null,null,null,null,null,null,null,null,null,{"$f":"IF(AND(COUNTIF(L18:L23,\"<5\")>=4,(COUNTIF(L18:L23,\"4\")>1)),SUMIF(L18:L23,\"<4\",K18:K23)+(SUMIF(L18:L23,\"=4\",K18:K23)/(COUNTIF(L18:L23,\"4\"))*1),\nIF(AND(COUNTIF(L18:L23,\"<5\")>=4,(COUNTIF(L18:L23,\"3\")>1)),SUMIF(L18:L23,\"<3\",K18:K23)+(SUMIF(L18:L23,\"=3\",K18:K23)/(COUNTIF(L18:L23,\"3\"))*2),\nIF(AND(COUNTIF(L18:L23,\"<5\")>=4,(COUNTIF(L18:L23,\"2\")>2)),SUMIF(L18:L23,\"<2\",K18:K23)+(SUMIF(L18:L23,\"=2\",K18:K23)/(COUNTIF(L18:L23,\"2\"))*3),\nIF(COUNTIF(L18:L23,\"=1\")>=4,((SUMIF(L18:L23,\"=1\",K18:K23)/COUNTIF(L18:L23,\"1\"))*4),\nIF(COUNTIF(L18:L23,\"<5\")=4,SUMIF(L18:L23,\"<5\",K18:K23))))))","v":220},null,null,null,null,null,null,null,null,null,null,null,{"$f":"IF(AND(COUNTIF(X18:X23,\"<5\")>=4,(COUNTIF(X18:X23,\"4\")>1)),SUMIF(X18:X23,\"<4\",W18:W23)+(SUMIF(X18:X23,\"=4\",W18:W23)/(COUNTIF(X18:X23,\"4\"))*1),\nIF(AND(COUNTIF(X18:X23,\"<5\")>=4,(COUNTIF(X18:X23,\"3\")>1)),SUMIF(X18:X23,\"<3\",W18:W23)+(SUMIF(X18:X23,\"=3\",W18:W23)/(COUNTIF(X18:X23,\"3\"))*2),\nIF(AND(COUNTIF(X18:X23,\"<5\")>=4,(COUNTIF(X18:X23,\"2\")>2)),SUMIF(X18:X23,\"<2\",W18:W23)+(SUMIF(X18:X23,\"=2\",W18:W23)/(COUNTIF(X18:X23,\"2\"))*3),\nIF(COUNTIF(X18:X23,\"=1\")>=4,((SUMIF(X18:X23,\"=1\",W18:W23)/COUNTIF(X18:X23,\"1\"))*4),\nIF(COUNTIF(X18:X23,\"<5\")=4,SUMIF(X18:X23,\"<5\",W18:W23))))))","v":225}]

{"sheet":"JV","index":2,"n_rows":24,"n_cols":7,"rows_kept":24,"cut":false,"hidden":false,"merged":[[10,2,11,2],[10,1,11,1],[10,0,11,0],[10,3,11,3],[10,4,11,4],[5,1,5,3],[6,1,6,3],[0,0,0,3],[0,5,0,6],[2,1,2,3],[4,4,4,6],[2,4,2,6]]}
["Fox Valley Association",null,null,null,null,"JV"]
[]
["Match Date:",{"$f":"IF(Scores!B5=\"\",\"Please enter date on 'Scores' page.\",Scores!B5)","v":"2023-09-08"},null,null,{"$f":"IF(Scores!B5=\"\",\"Report Date:\",CONCATENATE(\"Report Date: \",TEXT(Scores!B5,\"m/d/yyyy\")))","v":"Report Date: 9/8/2023"}]
[]
[null,null,null,null,"     Team Score"]
["School Reporting:",{"$f":"Scores!B10","v":"Hortonville"},null,null,"----->",{"$f":"Scores!K24","v":220}," "]
["Opponent:",{"$f":"Scores!N10","v":"Neenah"},null,null,"----->",{"$f":"Scores!W24","v":225}," "]
[]
["E-Mail this form to: webmaster@fvaathletics.org as an attachment",null,null,null,null,null,{"$f":"IF(F9=\"\",\"\",IF(COUNTIF(Scores!$A$18:$A$23,JV!F9)>0,Scores!$B$10,Scores!$N$10))","v":""}]
[]
["Name (First Last)","School","9 Hole\nScore","Position\nFinish Points","Opponents\nBeaten"]
[]
["Sydney Jones",{"$f":"IF(A13=\"\",\"\",IF(COUNTIF(Scores!$A$18:$A$23,JV!A13)>0,Scores!$B$10,Scores!$N$10))","v":"Hortonville"},52,{"$f":"IF(C13=\"\",\"\",IF(C13<>C14,F13,SUM(OFFSET(F13,0,0,COUNTIF(C13:C24,C13),1))/COUNTIF(C13:C24,C13)))","v":11.5},{"$f":"IF(C13>0,SUM(COUNTIFS($B$13:$B$24,\"<>\"&B13,$C$13:$C$24,\">\"&C13)+(0.5*SUM(COUNTIFS($B$13:$B$24,\"<>\"&B13,$C$13:$C$24,C13)))),\"\")","v":5.5},12]
["Jordyn Brockman",{"$f":"IF(A14=\"\",\"\",IF(COUNTIF(Scores!$A$18:$A$23,JV!A14)>0,Scores!$B$10,Scores!$N$10))","v":"Neenah"},52,{"$f":"IF(C14=\"\",\"\",IF(C14=C13,D13,IF(C14<>C15,F14,SUM(OFFSET(F14,0,0,COUNTIF(C14:C$24,C14),1))/COUNTIF(C14:C$24,C14))))","v":11.5},{"$f":"IF(C14>0,SUM(COUNTIFS($B$13:$B$24,\"<>\"&B14,$C$13:$C$24,\">\"&C14)+(0.5*SUM(COUNTIFS($B$13:$B$24,\"<>\"&B14,$C$13:$C$24,C14)))),\"\")","v":5.5},11]
["Tia Diamond",{"$f":"IF(A15=\"\",\"\",IF(COUNTIF(Scores!$A$18:$A$23,JV!A15)>0,Scores!$B$10,Scores!$N$10))","v":"Hortonville"},54,{"$f":"IF(C15=\"\",\"\",IF(C15=C14,D14,IF(C15<>C16,F15,SUM(OFFSET(F15,0,0,COUNTIF(C15:C$24,C15),1))/COUNTIF(C15:C$24,C15))))","v":9.5},4.5,10]
["Lilly Quella",{"$f":"IF(A16=\"\",\"\",IF(COUNTIF(Scores!$A$18:$A$23,JV!A16)>0,Scores!$B$10,Scores!$N$10))","v":"Neenah"},54,{"$f":"IF(C16=\"\",\"\",IF(C16=C15,D15,IF(C16<>C17,F16,SUM(OFFSET(F16,0,0,COUNTIF(C16:C$24,C16),1))/COUNTIF(C16:C$24,C16))))","v":9.5},4.5,9]
["Paige Clausen",{"$f":"IF(A17=\"\",\"\",IF(COUNTIF(Scores!$A$18:$A$23,JV!A17)>0,Scores!$B$10,Scores!$N$10))","v":"Hortonville"},56,{"$f":"IF(C17=\"\",\"\",IF(C17=C16,D16,IF(C17<>C18,F17,SUM(OFFSET(F17,0,0,COUNTIF(C17:C$24,C17),1))/COUNTIF(C17:C$24,C17))))","v":7.5},3.5,8]
["Ava Drach",{"$f":"IF(A18=\"\",\"\",IF(COUNTIF(Scores!$A$18:$A$23,JV!A18)>0,Scores!$B$10,Scores!$N$10))","v":"Neenah"},56,{"$f":"IF(C18=\"\",\"\",IF(C18=C17,D17,IF(C18<>C19,F18,SUM(OFFSET(F18,0,0,COUNTIF(C18:C$24,C18),1))/COUNTIF(C18:C$24,C18))))","v":7.5},3.5,7]
["Emily Derby",{"$f":"IF(A19=\"\",\"\",IF(COUNTIF(Scores!$A$18:$A$23,JV!A19)>0,Scores!$B$10,Scores!$N$10))","v":"Hortonville"},58,{"$f":"IF(C19=\"\",\"\",IF(C19=C18,D18,IF(C19<>C20,F19,SUM(OFFSET(F19,0,0,COUNTIF(C19:C$24,C19),1))/COUNTIF(C19:C$24,C19))))","v":6},3,6]
["Brooklyn Danke",{"$f":"IF(A20=\"\",\"\",IF(COUNTIF(Scores!$A$18:$A$23,JV!A20)>0,Scores!$B$10,Scores!$N$10))","v":"Hortonville"},60,{"$f":"IF(C20=\"\",\"\",IF(C20=C19,D19,IF(C20<>C21,F20,SUM(OFFSET(F20,0,0,COUNTIF(C20:C$24,C20),1))/COUNTIF(C20:C$24,C20))))","v":5},3,5]
["Adranne Oitzinger",{"$f":"IF(A21=\"\",\"\",IF(COUNTIF(Scores!$A$18:$A$23,JV!A21)>0,Scores!$B$10,Scores!$N$10))","v":"Neenah"},63,{"$f":"IF(C21=\"\",\"\",IF(C21=C20,D20,IF(C21<>C22,F21,SUM(OFFSET(F21,0,0,COUNTIF(C21:C$24,C21),1))/COUNTIF(C21:C$24,C21))))","v":4},1,4]
["Camryn Breaker",{"$f":"IF(A22=\"\",\"\",IF(COUNTIF(Scores!$A$18:$A$23,JV!A22)>0,Scores!$B$10,Scores!$N$10))","v":"Hortonville"},65,{"$f":"IF(C22=\"\",\"\",IF(C22=C21,D21,IF(C22<>C23,F22,SUM(OFFSET(F22,0,0,COUNTIF(C22:C$24,C22),1))/COUNTIF(C22:C$24,C22))))","v":3},2,3]
["JV 11",{"$f":"IF(A23=\"\",\"\",IF(COUNTIF(Scores!$A$18:$A$23,JV!A23)>0,Scores!$B$10,Scores!$N$10))","v":"Neenah"},81,{"$f":"IF(C23=\"\",\"\",IF(C23=C22,D22,IF(C23<>C24,F23,SUM(OFFSET(F23,0,0,COUNTIF(C23:C$24,C23),1))/COUNTIF(C23:C$24,C23))))","v":1.5},0,2]
["JV 12",{"$f":"IF(A24=\"\",\"\",IF(COUNTIF(Scores!$A$18:$A$23,JV!A24)>0,Scores!$B$10,Scores!$N$10))","v":"Neenah"},81,{"$f":"IF(C24=\"\",\"\",IF(C24=C23,D23,IF(C24<>C25,F24,SUM(OFFSET(F24,0,0,COUNTIF(C24:C$24,C24),1))/COUNTIF(C24:C$24,C24))))","v":1.5},0,1]

{"sheet":"Sheet1","index":3,"n_rows":0,"n_cols":0,"rows_kept":0,"cut":false,"hidden":false,"merged":[]}