{"text_format":"1","workbook":"xlsx","n_sheets":15,"sheets":["WL","WBW","WBE","WT","OC","BD","HT","SL","Conf","Standings","ALL CONFERENCE TEAMS","FINAL PlayerStats","DISREGARD STANDINGS PlayerStats","Rosters","Schedule"],"not_rendered":{"charts":0,"images":62,"macros":1,"external_links":0,"defined_names":26,"comments":0,"pivot_tables":0},"unopened":[],"bounds":{"document_bytes":16777216,"sheet_cells":100000,"rows_first":2000,"rows_last":500,"rows_between":2000,"halvings":0,"cell_chars":16384,"cell_head_chars":4096},"cells_cut":0,"cells_raw":0,"read":"whole","date_system":"1900"}

{"sheet":"WL","index":0,"n_rows":440,"n_cols":56,"rows_kept":440,"cut":false,"hidden":false,"merged":[[130,2,130,11],[114,2,114,11],[119,2,119,11],[40,16,40,26],[0,2,0,11],[99,2,99,11],[104,2,104,11],[46,1,48,12],[125,2,125,11]]}
[null,"Course:   ","New Berlin Hills Golf Course"]
[null,"Hole   ",10,11,12,13,14,15,16,17,18,"Total",null,null,null,null,"Hole   ",{"$f":"C2","v":10},11,12,13,14,15,16,17,18,"Total"]
[null,"  Par   ",4,4,3,5,4,3,4,4,4,{"$f":"SUM(C3:K3)","v":35},null,null,null,null,"  Par   ",4,4,3,5,4,3,4,4,4,{"$f":"L3","v":35}]
[null,"Handicap  ",6,8,18,2,12,16,10,14,4,null,null,null,null,null,"Handicap  ",6,8,18,2,12,16,10,14,4]
[]
[]
["Player","BEAVER DAM",null,null,null,null,null,null,null,null,null,null,"Place",null,null,"Player","WATERTOWN",null,null,null,null,null,null,null,null,null,null,"Place"]
[1,"Koby Jones - 12",4,5,4,5,4,6,3,4,5,{"$f":"IF(COUNTBLANK(C8:K8)>0,\"\",SUM(C8:K8))","v":40},{"$f":"VLOOKUP(BA8,$B$301:$E$340,4)","v":4},null,null,1,"Cameron Boyd - 11",4,5,4,6,5,5,5,5,5,{"$f":"IF(COUNTBLANK(R8:Z8)>0,\"\",SUM(R8:Z8))","v":44},{"$f":"VLOOKUP(BB8,$B$301:$E$340,4)","v":13},null,null,null,null,null,null,null,null,null,null,null,null,null,null,null,null,null,null,null,null,null,null,null,null,1,21,{"$f":"LEN(L8)","v":2},{"$f":"LEN(AA8)","v":2}]
[2,"Thomas Bleich - 11",6,4,3,8,5,6,5,4,7,{"$f":"IF(COUNTBLANK(C9:K9)>0,\"\",SUM(C9:K9))","v":48},{"$f":"VLOOKUP(BA9,$B$301:$E$340,4)","v":21},null,null,2,"Alex Thompson - 9",6,4,4,6,6,5,5,4,5,{"$f":"IF(COUNTBLANK(R9:Z9)>0,\"\",SUM(R9:Z9))","v":45},{"$f":"VLOOKUP(BB9,$B$301:$E$340,4)","v":15},null,null,null,null,null,null,null,null,null,null,null,null,null,null,null,null,null,null,null,null,null,null,null,null,2,22,{"$f":"LEN(L9)","v":2},{"$f":"LEN(AA9)","v":2}]
[3,"Jacob Smith - 10",6,5,5,5,5,5,6,5,6,{"$f":"IF(COUNTBLANK(C10:K10)>0,\"\",SUM(C10:K10))","v":48},{"$f":"VLOOKUP(BA10,$B$301:$E$340,4)","v":21},null,null,3,"Collin Travis - 11",6,7,5,8,6,4,11,5,5,{"$f":"IF(COUNTBLANK(R10:Z10)>0,\"\",SUM(R10:Z10))","v":57},{"$f":"VLOOKUP(BB10,$B$301:$E$340,4)","v":35},null,null,null,null,null,null,null,null,null,null,null,null,null,null,null,null,null,null,null,null,null,null,null,null,3,23,{"$f":"LEN(L10)","v":2},{"$f":"LEN(AA10)","v":2}]
[4,"Cody Trottier - 12",4,5,4,6,5,4,5,5,5,{"$f":"IF(COUNTBLANK(C11:K11)>0,\"\",SUM(C11:K11))","v":43},{"$f":"VLOOKUP(BA11,$B$301:$E$340,4)","v":11},null,null,4,"Austin Douglas - 10",6,5,4,6,5,4,7,5,8,{"$f":"IF(COUNTBLANK(R11:Z11)>0,\"\",SUM(R11:Z11))","v":50},{"$f":"VLOOKUP(BB11,$B$301:$E$340,4)","v":29},null,null,null,null,null,null,null,null,null,null,null,null,null,null,null,null,null,null,null,null,null,null,null,null,4,24,{"$f":"LEN(L11)","v":2},{"$f":"LEN(AA11)","v":2}]
[5,"Carter Smith - 11",5,6,4,6,5,5,5,3,5,{"$f":"IF(COUNTBLANK(C12:K12)>0,\"\",SUM(C12:K12))","v":44},{"$f":"VLOOKUP(BA12,$B$301:$E$340,4)","v":13},null,null,5,"Dylan Rahfaldt - 9",7,6,6,7,7,5,8,6,6,{"$f":"IF(COUNTBLANK(R12:Z12)>0,\"\",SUM(R12:Z12))","v":58},{"$f":"VLOOKUP(BB12,$B$301:$E$340,4)","v":37},null,null,null,null,null,null,null,null,null,null,null,null,null,null,null,null,null,null,null,null,null,null,null,null,5,25,{"$f":"LEN(L12)","v":2},{"$f":"LEN(AA12)","v":2}]
[null,null,null,null,null,null,null,null,null,null,null,{"$f":"IF(COUNT(L8:L12)=5,(SUM(L8:L12))-(MAX(L8:L12)),(IF(COUNT(L8:L12)=4,SUM(L8:L12),IF(COUNTBLANK(L8:L12)>0,SUM(L8:L12),\"DQ\"))))","v":175},{"$f":"J351","v":3},null,null,null,null,null,null,null,null,null,null,null,null,null,{"$f":"IF(COUNT(AA8:AA12)=5,(SUM(AA8:AA12))-(MAX(AA8:AA12)),(IF(COUNT(AA8:AA12)=4,SUM(AA8:AA12),IF(COUNTBLANK(AA8:AA12)>0,SUM(AA8:AA12),\"DQ\"))))","v":196},{"$f":"J355","v":7}]
[null,null,null,null,null,null,null,null,null,null,null,{"$f":"IF(COUNT(L8:L12)=5,MAX(L8:L12),IF(COUNT(L8:L12)<5,200,))","v":48},null,null,null,null,null,null,null,null,null,null,null,null,null,null,{"$f":"IF(COUNT(AA8:AA12)=5,MAX(AA8:AA12),IF(COUNT(AA8:AA12)<5,200,))","v":58}]
["Player","HARTFORD",null,null,null,null,null,null,null,null,null,null,"Place",null,null,"Player","WEST BEND EAST",null,null,null,null,null,null,null,null,null,null,"Place"]
[1,"Ryan Ruona - 11",6,4,2,5,5,3,4,4,5,{"$f":"IF(COUNTBLANK(C16:K16)>0,\"\",SUM(C16:K16))","v":38},{"$f":"VLOOKUP(BA16,$B$301:$E$340,4)","v":1},null,null,1,"Devon Hanson - 11",4,5,3,4,4,3,5,4,6,{"$f":"IF(COUNTBLANK(R16:Z16)>0,\"\",SUM(R16:Z16))","v":38},{"$f":"VLOOKUP(BB16,$B$301:$E$340,4)","v":1},null,null,null,null,null,null,null,null,null,null,null,null,null,null,null,null,null,null,null,null,null,null,null,null,6,26,{"$f":"LEN(L16)","v":2},{"$f":"LEN(AA16)","v":2}]
[2,"John Turchi - 10",5,5,6,6,6,5,6,7,5,{"$f":"IF(COUNTBLANK(C17:K17)>0,\"\",SUM(C17:K17))","v":51},{"$f":"VLOOKUP(BA17,$B$301:$E$340,4)","v":33},null,null,2,"Mitch Saari - 12",7,5,6,5,6,4,4,5,5,{"$f":"IF(COUNTBLANK(R17:Z17)>0,\"\",SUM(R17:Z17))","v":47},{"$f":"VLOOKUP(BB17,$B$301:$E$340,4)","v":19},null,null,null,null,null,null,null,null,null,null,null,null,null,null,null,null,null,null,null,null,null,null,null,null,7,27,{"$f":"LEN(L17)","v":2},{"$f":"LEN(AA17)","v":2}]
[3,"Lucas Hass - 11",6,6,5,7,6,5,5,4,6,{"$f":"IF(COUNTBLANK(C18:K18)>0,\"\",SUM(C18:K18))","v":50},{"$f":"VLOOKUP(BA18,$B$301:$E$340,4)","v":29},null,null,3,"Sam Struebing - 11",6,5,6,6,5,4,5,6,6,{"$f":"IF(COUNTBLANK(R18:Z18)>0,\"\",SUM(R18:Z18))","v":49},{"$f":"VLOOKUP(BB18,$B$301:$E$340,4)","v":24},null,null,null,null,null,null,null,null,null,null,null,null,null,null,null,null,null,null,null,null,null,null,null,null,8,28,{"$f":"LEN(L18)","v":2},{"$f":"LEN(AA18)","v":2}]
[4,"Jake Lidwin - 11",6,6,4,6,6,4,4,8,6,{"$f":"IF(COUNTBLANK(C19:K19)>0,\"\",SUM(C19:K19))","v":50},{"$f":"VLOOKUP(BA19,$B$301:$E$340,4)","v":29},null,null,4,"Josh Breuer - 12",6,7,4,8,6,5,4,4,5,{"$f":"IF(COUNTBLANK(R19:Z19)>0,\"\",SUM(R19:Z19))","v":49},{"$f":"VLOOKUP(BB19,$B$301:$E$340,4)","v":24},null,null,null,null,null,null,null,null,null,null,null,null,null,null,null,null,null,null,null,null,null,null,null,null,9,29,{"$f":"LEN(L19)","v":2},{"$f":"LEN(AA19)","v":2}]
[5,"Luke Carroll - 10",11,5,3,6,6,7,7,6,6,{"$f":"IF(COUNTBLANK(C20:K20)>0,\"\",SUM(C20:K20))","v":57},{"$f":"VLOOKUP(BA20,$B$301:$E$340,4)","v":35},null,null,5,"Brad Halverson - 9",6,6,4,5,6,4,5,5,8,{"$f":"IF(COUNTBLANK(R20:Z20)>0,\"\",SUM(R20:Z20))","v":49},{"$f":"VLOOKUP(BB20,$B$301:$E$340,4)","v":24},null,null,null,null,null,null,null,null,null,null,null,null,null,null,null,null,null,null,null,null,null,null,null,null,10,30,{"$f":"LEN(L20)","v":2},{"$f":"LEN(AA20)","v":2}]
[null,null,null,null,null,null,null,null,null,null,null,{"$f":"IF(COUNT(L16:L20)=5,(SUM(L16:L20))-(MAX(L16:L20)),(IF(COUNT(L16:L20)=4,SUM(L16:L20),IF(COUNTBLANK(L16:L20)>0,SUM(L16:L20),\"DQ\"))))","v":189},{"$f":"J352","v":6},null,null,null,null,null,null,null,null,null,null,null,null,null,{"$f":"IF(COUNT(AA16:AA20)=5,(SUM(AA16:AA20))-(MAX(AA16:AA20)),(IF(COUNT(AA16:AA20)=4,SUM(AA16:AA20),IF(COUNTBLANK(AA16:AA20)>0,SUM(AA16:AA20),\"DQ\"))))","v":183},{"$f":"J356","v":5}]
[null,null,null,null,null,null,null,null,null,null,null,{"$f":"IF(COUNT(L16:L20)=5,MAX(L16:L20),IF(COUNT(L16:L20)<5,200,))","v":57},null,null,null,null,null,null,null,null,null,null,null,null,null,null,{"$f":"IF(COUNT(AA16:AA20)=5,MAX(AA16:AA20),IF(COUNT(AA16:AA20)<5,200,))","v":49}]
["Player","OCONOMOWOC",null,null,null,null,null,null,null,null,null,null,"Place",null,null,"Player","WEST BEND WEST",null,null,null,null,null,null,null,null,null,null,"Place"]
[1,"George Kneiser - 11",6,4,3,5,4,5,5,4,6,{"$f":"IF(COUNTBLANK(C24:K24)>0,\"\",SUM(C24:K24))","v":42},{"$f":"VLOOKUP(BA24,$B$301:$E$340,4)","v":6},null,null,1,"Alex Haas - 12",4,5,4,5,5,5,4,5,5,{"$f":"IF(COUNTBLANK(R24:Z24)>0,\"\",SUM(R24:Z24))","v":42},{"$f":"VLOOKUP(BB24,$B$301:$E$340,4)","v":6},null,null,null,null,null,null,null,null,null,null,null,null,null,null,null,null,null,null,null,null,null,null,null,null,11,31,{"$f":"LEN(L24)","v":2},{"$f":"LEN(AA24)","v":2}]
[2,"Colin Prom - 12",4,5,4,5,5,5,4,4,4,{"$f":"IF(COUNTBLANK(C25:K25)>0,\"\",SUM(C25:K25))","v":40},{"$f":"VLOOKUP(BA25,$B$301:$E$340,4)","v":4},null,null,2,"Max Rohlinger - 10",5,4,4,5,4,5,5,5,5,{"$f":"IF(COUNTBLANK(R25:Z25)>0,\"\",SUM(R25:Z25))","v":42},{"$f":"VLOOKUP(BB25,$B$301:$E$340,4)","v":6},null,null,null,null,null,null,null,null,null,null,null,null,null,null,null,null,null,null,null,null,null,null,null,null,12,32,{"$f":"LEN(L25)","v":2},{"$f":"LEN(AA25)","v":2}]
[3,"Allan Moutvic - 12",5,5,3,6,4,3,6,4,6,{"$f":"IF(COUNTBLANK(C26:K26)>0,\"\",SUM(C26:K26))","v":42},{"$f":"VLOOKUP(BA26,$B$301:$E$340,4)","v":6},null,null,3,"Jacob Droese - 12",6,4,4,7,5,4,5,5,6,{"$f":"IF(COUNTBLANK(R26:Z26)>0,\"\",SUM(R26:Z26))","v":46},{"$f":"VLOOKUP(BB26,$B$301:$E$340,4)","v":17},null,null,null,null,null,null,null,null,null,null,null,null,null,null,null,null,null,null,null,null,null,null,null,null,13,33,{"$f":"LEN(L26)","v":2},{"$f":"LEN(AA26)","v":2}]
[4,"Brett Lange - 12",5,4,5,6,5,7,4,5,8,{"$f":"IF(COUNTBLANK(C27:K27)>0,\"\",SUM(C27:K27))","v":49},{"$f":"VLOOKUP(BA27,$B$301:$E$340,4)","v":24},null,null,4,"Kevin Albrecht - 11",4,7,4,4,6,4,4,4,5,{"$f":"IF(COUNTBLANK(R27:Z27)>0,\"\",SUM(R27:Z27))","v":42},{"$f":"VLOOKUP(BB27,$B$301:$E$340,4)","v":6},null,null,null,null,null,null,null,null,null,null,null,null,null,null,null,null,null,null,null,null,null,null,null,null,14,34,{"$f":"LEN(L27)","v":2},{"$f":"LEN(AA27)","v":2}]
[5,"Sam Hosch - 12",6,5,3,6,5,5,5,10,6,{"$f":"IF(COUNTBLANK(C28:K28)>0,\"\",SUM(C28:K28))","v":51},{"$f":"VLOOKUP(BA28,$B$301:$E$340,4)","v":33},null,null,5,"Marvin Bateman  - 11",6,6,3,6,4,4,6,5,5,{"$f":"IF(COUNTBLANK(R28:Z28)>0,\"\",SUM(R28:Z28))","v":45},{"$f":"VLOOKUP(BB28,$B$301:$E$340,4)","v":15},null,null,null,null,null,null,null,null,null,null,null,null,null,null,null,null,null,null,null,null,null,null,null,null,15,35,{"$f":"LEN(L28)","v":2},{"$f":"LEN(AA28)","v":2}]
[null,null,null,null,null,null,null,null,null,null,null,{"$f":"IF(COUNT(L24:L28)=5,(SUM(L24:L28))-(MAX(L24:L28)),(IF(COUNT(L24:L28)=4,SUM(L24:L28),IF(COUNTBLANK(L24:L28)>0,SUM(L24:L28),\"DQ\"))))","v":173},{"$f":"J353","v":2},null,null,null,null,null,null,null,null,null,null,null,null,null,{"$f":"IF(COUNT(AA24:AA28)=5,(SUM(AA24:AA28))-(MAX(AA24:AA28)),(IF(COUNT(AA24:AA28)=4,SUM(AA24:AA28),IF(COUNTBLANK(AA24:AA28)>0,SUM(AA24:AA28),\"DQ\"))))","v":171},{"$f":"J357","v":1}]
[null,null,null,null,null,null,null,null,null,null,null,{"$f":"IF(COUNT(L24:L28)=5,MAX(L24:L28),IF(COUNT(L24:L28)<5,200,))","v":51},null,null,null,null,null,null,null,null,null,null,null,null,null,null,{"$f":"IF(COUNT(AA24:AA28)=5,MAX(AA24:AA28),IF(COUNT(AA24:AA28)<5,200,))","v":46}]
["Player","SLINGER",null,null,null,null,null,null,null,null,null,null,"Place",null,null,"Player","WISCONSIN LUTHERAN",null,null,null,null,null,null,null,null,null,null,"Place"]
[1,"Austin Walsh - 12",5,6,5,7,5,4,5,5,4,{"$f":"IF(COUNTBLANK(C32:K32)>0,\"\",SUM(C32:K32))","v":46},{"$f":"VLOOKUP(BA32,$B$301:$E$340,4)","v":17},null,null,1,"Zachary Stahle - 11",7,5,4,6,5,4,6,5,5,{"$f":"IF(COUNTBLANK(R32:Z32)>0,\"\",SUM(R32:Z32))","v":47},{"$f":"VLOOKUP(BB32,$B$301:$E$340,4)","v":19},null,null,null,null,null,null,null,null,null,null,null,null,null,null,null,null,null,null,null,null,null,null,null,null,16,36,{"$f":"LEN(L32)","v":2},{"$f":"LEN(AA32)","v":2}]
[2,"Jack Burns - 12",6,4,3,5,4,3,4,5,5,{"$f":"IF(COUNTBLANK(C33:K33)>0,\"\",SUM(C33:K33))","v":39},{"$f":"VLOOKUP(BA33,$B$301:$E$340,4)","v":3},null,null,2,"Ben Krause - 11",6,7,4,7,6,5,5,4,5,{"$f":"IF(COUNTBLANK(R33:Z33)>0,\"\",SUM(R33:Z33))","v":49},{"$f":"VLOOKUP(BB33,$B$301:$E$340,4)","v":24},null,null,null,null,null,null,null,null,null,null,null,null,null,null,null,null,null,null,null,null,null,null,null,null,17,37,{"$f":"LEN(L33)","v":2},{"$f":"LEN(AA33)","v":2}]
[3,"Chris Evans - 11",6,5,5,5,4,4,4,4,6,{"$f":"IF(COUNTBLANK(C34:K34)>0,\"\",SUM(C34:K34))","v":43},{"$f":"VLOOKUP(BA34,$B$301:$E$340,4)","v":11},null,null,3,"Scratch #1 - ",9,9,9,9,9,9,9,9,9,{"$f":"IF(COUNTBLANK(R34:Z34)>0,\"\",SUM(R34:Z34))","v":81},{"$f":"VLOOKUP(BB34,$B$301:$E$340,4)","v":38},null,null,null,null,null,null,null,null,null,null,null,null,null,null,null,null,null,null,null,null,null,null,null,null,18,38,{"$f":"LEN(L34)","v":2},{"$f":"LEN(AA34)","v":2}]
[4,"Ryan Erdmann - 9",6,6,4,6,6,3,5,5,7,{"$f":"IF(COUNTBLANK(C35:K35)>0,\"\",SUM(C35:K35))","v":48},{"$f":"VLOOKUP(BA35,$B$301:$E$340,4)","v":21},null,null,4,"Scratch #2 - ",9,9,9,9,9,9,9,9,9,{"$f":"IF(COUNTBLANK(R35:Z35)>0,\"\",SUM(R35:Z35))","v":81},{"$f":"VLOOKUP(BB35,$B$301:$E$340,4)","v":38},null,null,null,null,null,null,null,null,null,null,null,null,null,null,null,null,null,null,null,null,null,null,null,null,19,39,{"$f":"LEN(L35)","v":2},{"$f":"LEN(AA35)","v":2}]
[5,"Howie Wolf - 12",5,5,4,6,7,7,6,5,5,{"$f":"IF(COUNTBLANK(C36:K36)>0,\"\",SUM(C36:K36))","v":50},{"$f":"VLOOKUP(BA36,$B$301:$E$340,4)","v":29},null,null,5,"Scratch #3 - ",9,9,9,9,9,9,9,9,9,{"$f":"IF(COUNTBLANK(R36:Z36)>0,\"\",SUM(R36:Z36))","v":81},{"$f":"VLOOKUP(BB36,$B$301:$E$340,4)","v":38},null,null,null,null,null,null,null,null,null,null,null,null,null,null,null,null,null,null,null,null,null,null,null,null,20,40,{"$f":"LEN(L36)","v":2},{"$f":"LEN(AA36)","v":2}]
[null,null,null,null,null,null,null,null,null,null,null,{"$f":"IF(COUNT(L32:L36)=5,(SUM(L32:L36))-(MAX(L32:L36)),(IF(COUNT(L32:L36)=4,SUM(L32:L36),IF(COUNTBLANK(L32:L36)>0,SUM(L32:L36),\"DQ\"))))","v":176},{"$f":"J354","v":4},null,null,null,null,null,null,null,null,null,null,null,null,null,{"$f":"IF(COUNT(AA32:AA36)=5,(SUM(AA32:AA36))-(MAX(AA32:AA36)),(IF(COUNT(AA32:AA36)=4,SUM(AA32:AA36),IF(COUNTBLANK(AA32:AA36)>0,SUM(AA32:AA36),\"DQ\"))))","v":258},{"$f":"J358","v":8}]
[null,null,null,null,null,null,null,null,null,null,null,{"$f":"IF(COUNT(L32:L36)=5,MAX(L32:L36),IF(COUNT(L32:L36)<5,200,))","v":50},null,null,null,null,null,null,null,null,null,null,null,null,null,null,{"$f":"IF(COUNT(AA32:AA36)=5,MAX(AA32:AA36),IF(COUNT(AA32:AA36)<5,200,))","v":81}]
[]
[]
[null,"Wisconsin Little Ten Varsity Golf",null,null,null,null,"Match # 1",null,null,null,null,"Hosted By:","Wisconsin Lutheran",null,null,null,{"$f":"\"WISCONSIN LITTLE TEN CONFERENCE STANDINGS \" & Schedule!Q41","v":"WISCONSIN LITTLE TEN CONFERENCE STANDINGS "}]
[null,null,null,null,null,null,null,null,null,null,null,null,null,null,null,null,"Match  ","1",2,3,4,5,6,7,8,9,"Total"]
[null,"Date: Apr 14, 2015",null,{"$f":"\"Location: \" & C1","v":"Location: New Berlin Hills Golf Course"},null,null,null,null,null,null,null,null,null,null,null,null,{"$f":"Rosters!$B$10","v":"West Bend West"},1,null,null,null,null,null,null,null,null,{"$f":"IF(SUM(R43:Z43)=0,\"\",SUM(R43:Z43))","v":1}]
[null,null,null,null,null,null,null,null,null,null,null,null,null,null,null,null,{"$f":"Rosters!$B$6","v":"Oconomowoc"},2,null,null,null,null,null,null,null,null,2]
[null,"Weather - 65 and Sunny ",null,null,null,null,null,null,null,null,null,null,null,null,null,null,{"$f":"Rosters!$B$4","v":"Beaver Dam"},3,null,null,null,null,null,null,null,null,3]
[null,"(really, no kidding! )",null,null,null,null,null,null,null,null,null,null,null,null,null,null,{"$f":"Rosters!$B$7","v":"Slinger"},4,null,null,null,null,null,null,null,null,4]
[null,"Medalists: (38) - Ryan Ruona, Devon Hanson",null,null,null,null,null,null,null,null,null,null,null,null,null,null,{"$f":"Rosters!$B$9","v":"West Bend East"},5,null,null,null,null,null,null,null,null,5]
[null,null,null,null,null,null,null,null,null,null,null,null,null,null,null,null,{"$f":"Rosters!$B$5","v":"Hartford"},6,null,null,null,null,null,null,null,null,6]
[null,null,null,null,null,null,null,null,null,null,null,null,null,null,null,null,{"$f":"Rosters!$B$8","v":"Watertown"},7,null,null,null,null,null,null,null,null,7]
[null,null,null,null,null,null,null,null,null,null,null,"= Birdies or Better",null,null,null,null,{"$f":"Rosters!$B$11","v":"Wisconsin Lutheran"},8,null,null,null,null,null,null,null,null,8]
[]
[]
[]
[]
[]
[]
[]
[]
[]
[]
[]
[]
[]
[]
[]
[]
[]
[]
[]
[]
[]
[]
[]
[]
[]
[]
[]
[]
[]
[]
[]
[]
[]
[]
[]
[]
[]
[]
[]
[]
[]
[]
[]
[]
[]
[]
[]
[]
[]
[null,"Course:   ","New Berlin Hills Golf Course"]
[null,"Hole   ",1,2,3,4,5,6,7,8,9,"Total"]
[null,"  Par   ",5,4,4,4,4,4,3,4,4,{"$f":"SUM(C102:K102)","v":36}]
[null,"Handicap  ",3,15,5,13,9,1,17,11,7]
[]
[null,"Course:   ","New Berlin Hills Golf Course"]
[null,"Hole   ",10,11,12,13,14,15,16,17,18,"Total"]
[null,"  Par   ",4,4,3,5,4,3,4,4,4,{"$f":"SUM(C107:K107)","v":35}]
[null,"Handicap  ",6,8,18,2,12,16,10,14,4]
[]
[]
[]
[]
[]
[]
[null,"Course:   ","New Berlin Hills Golf Course"]
[null,"Hole   ",1,2,3,4,5,6,7,8,9,"Total"]
[null,"  Par   ",5,4,4,4,4,4,3,4,4,{"$f":"SUM(C117:K117)","v":36}]
[null,"Handicap  ",3,15,5,13,9,1,17,11,7]
[]
[null,"Course:   ","New Berlin Hills Golf Course"]
[null,"Hole   ",10,11,12,13,14,15,16,17,18,"Total"]
[null,"  Par   ",4,4,3,5,4,3,4,4,4,{"$f":"SUM(C122:K122)","v":35}]
[null,"Handicap  ",6,8,18,2,12,16,10,14,4]
[]
[]
[null,"Course:   ","Silver Spring CC (Island)"]
[null,"Hole   ",1,2,3,4,5,6,7,8,9,"Total"]
[null,"  Par   ",4,4,4,3,5,4,5,3,4,{"$f":"SUM(C128:K128)","v":36}]
[null,"Handicap  ",5,9,13,15,1,11,3,17,7]
[]
[null,"Course:   ","Silver Spring CC (Island)"]
[null,"Hole   ",10,11,12,13,14,15,16,17,18,"Total"]
[null,"  Par   ",3,4,4,5,3,4,4,5,4,{"$f":"SUM(C133:K133)","v":36}]
[null,"Handicap  ",16,10,14,2,18,6,12,4,8]
[]
[]
[]
[]
[]
[]
[]
[]
[]
[]
[]
[]
[]
[]
[]
[]
[]
[]
[]
[]
[]
[]
[]
[]
[]
[]
[]
[]
[]
[]
[]
[]
[]
[]
[]
[]
[]
[]
[]
[]
[]
[]
[]
[]
[]
[]
[]
[]
[]
[]
[]
[]
[]
[]
[]
[]
[]
[]
[]
[]
[]
[]
[]
[]
[]
[]
[]
[]
[]
[]
[]
[]
[]
[]
[]
[]
[]
[]
[]
[]
[]
[]
[]
[]
[]
[]
[]
[]
[]
[]
[]
[]
[]
[]
[]
[]
[]
[]
[]
[]
[]
[]
[]
[]
[]
[]
[]
[]
[]
[]
[]
[]
[]
[]
[]
[]
[]
[]
[]
[]
[]
[]
[]
[]
[]
[]
[]
[]
[]
[]
[]
[]
[]
[]
[]
[]
[]
[]
[]
[]
[]
[]
[]
[]
[]
[]
[]
[]
[]
[]
[]
[]
[]
[]
[]
[]
[]
[]
[]
[]
[]
[]
[]
[]
[]
[null,"Player","Sc","Sort","Rnk"]
[null,1,{"$f":"$L$8","v":40},null,4]
[null,2,{"$f":"$L$9","v":48},null,21]
[null,3,{"$f":"$L$10","v":48},null,21]
[null,4,{"$f":"$L$11","v":43},null,11]
[null,5,{"$f":"$L$12","v":44},null,13]
[null,6,{"$f":"$L$16","v":38},null,1]
[null,7,{"$f":"$L$17","v":51},null,33]
[null,8,{"$f":"$L$18","v":50},null,29]
[null,9,{"$f":"$L$19","v":50},null,29]
[null,10,{"$f":"$L$20","v":57},null,35]
[null,11,{"$f":"$L$24","v":42},null,6]
[null,12,{"$f":"$L$25","v":40},null,4]
[null,13,{"$f":"$L$26","v":42},null,6]
[null,14,{"$f":"$L$27","v":49},null,24]
[null,15,{"$f":"$L$28","v":51},null,33]
[null,16,{"$f":"$L$32","v":46},null,17]
[null,17,{"$f":"$L$33","v":39},null,3]
[null,18,{"$f":"$L$34","v":43},null,11]
[null,19,{"$f":"$L$35","v":48},null,21]
[null,20,{"$f":"$L$36","v":50},null,29]
[null,21,{"$f":"$AA$8","v":44},null,13]
[null,22,{"$f":"$AA$9","v":45},null,15]
[null,23,{"$f":"$AA$10","v":57},null,35]
[null,24,{"$f":"$AA$11","v":50},null,29]
[null,25,{"$f":"$AA$12","v":58},null,37]
[null,26,{"$f":"$AA$16","v":38},null,1]
[null,27,{"$f":"$AA$17","v":47},null,19]
[null,28,{"$f":"$AA$18","v":49},null,24]
[null,29,{"$f":"$AA$19","v":49},null,24]
[null,30,{"$f":"$AA$20","v":49},null,24]
[null,31,{"$f":"$AA$24","v":42},null,6]
[null,32,{"$f":"$AA$25","v":42},null,6]
[null,33,{"$f":"$AA$26","v":46},null,17]
[null,34,{"$f":"$AA$27","v":42},null,6]
[null,35,{"$f":"$AA$28","v":45},null,15]
[null,36,{"$f":"$AA$32","v":47},null,19]
[null,37,{"$f":"$AA$33","v":49},null,24]
[null,38,{"$f":"$AA$34","v":81},null,38]
[null,39,{"$f":"$AA$35","v":81},null,38]
[null,40,{"$f":"$AA$36","v":81},null,38]
[null,{"$f":"B69","v":0}]
[null,{"$f":"B70","v":0}]
[null,{"$f":"B71","v":0}]
[]
[]
[]
[]
[]
[null,null,null,null,null,null,null,null,null,{"$f":"DCOUNT(J350:J358,1,J347:J348)","v":8}]
[null,null,1,2,3,4,5,null,"Tot","Rank"]
[null,"Team1",{"$f":"$L$8","v":40},{"$f":"$L$9","v":48},{"$f":"$L$10","v":48},{"$f":"$L$11","v":43},{"$f":"$L$12","v":44},{"$f":"$L$14","v":48},{"$f":"$L$13","v":175},3,null,3,null,null,null,null,null,0,0,0,0,0,0,0,0,0]
[null,"Team2",{"$f":"$L$16","v":38},{"$f":"$L$17","v":51},{"$f":"$L$18","v":50},{"$f":"$L$19","v":50},{"$f":"$L$20","v":57},{"$f":"$L$22","v":57},{"$f":"$L$21","v":189},6,null,6,null,null,null,null,null,0,0,0,0,0,0,0,0,0]
[null,"Team3",{"$f":"$L$24","v":42},{"$f":"$L$25","v":40},{"$f":"$L$26","v":42},{"$f":"$L$27","v":49},{"$f":"$L$28","v":51},{"$f":"$L$30","v":51},{"$f":"$L$29","v":173},2,null,2,null,null,null,null,null,0,0,0,0,0,0,0,0,0]
[null,"Team4",{"$f":"$L$32","v":46},{"$f":"$L$33","v":39},{"$f":"$L$34","v":43},{"$f":"$L$35","v":48},{"$f":"$L$36","v":50},{"$f":"$L$38","v":50},{"$f":"$L$37","v":176},4,null,4,null,null,null,null,null,0,0,0,0,0,0,0,0,0]
[null,"Team5",{"$f":"$AA$8","v":44},{"$f":"$AA$9","v":45},{"$f":"$AA$10","v":57},{"$f":"$AA$11","v":50},{"$f":"$AA$12","v":58},{"$f":"$AA$14","v":58},{"$f":"$AA$13","v":196},7,null,7,null,null,null,null,null,0,0,0,0,0,0,0,0,0]
[null,"Team6",{"$f":"$AA$16","v":38},{"$f":"$AA$17","v":47},{"$f":"$AA$18","v":49},{"$f":"$AA$19","v":49},{"$f":"$AA$20","v":49},{"$f":"$AA$22","v":49},{"$f":"$AA$21","v":183},5,null,5,null,null,null,null,null,0,0,0,0,0,0,0,0,0]
[null,"Team7",{"$f":"$AA$24","v":42},{"$f":"$AA$25","v":42},{"$f":"$AA$26","v":46},{"$f":"$AA$27","v":42},{"$f":"$AA$28","v":45},{"$f":"$AA$30","v":46},{"$f":"$AA$29","v":171},1,null,1,null,null,null,null,null,0,0,0,0,0,0,0,0,0]
[null,"Team8",{"$f":"$AA$32","v":47},{"$f":"$AA$33","v":49},{"$f":"$AA$34","v":81},{"$f":"$AA$35","v":81},{"$f":"$AA$36","v":81},{"$f":"$AA$38","v":81},{"$f":"$AA$37","v":258},8,null,8,null,null,null,null,null,0,0,0,0,0,0,0,0,0]
[]
[]
[]
[]
[]
[]
[]
[]
[]
[]
[]
[]
[]
[]
[]
[]
[]
[]
[]
[]
[]
[]
[]
[]
[]
[]
[]
[]
[]
[]
[]
[]
[]
[]
[]
[]
[]
[]
[]
[]
[]
[]
[null,{"$f":"B8","v":"Koby Jones - 12"},{"$f":"L8","v":40}]
[null,{"$f":"B9","v":"Thomas Bleich - 11"},{"$f":"L9","v":48}]
[null,{"$f":"B10","v":"Jacob Smith - 10"},{"$f":"L10","v":48}]
[null,{"$f":"B11","v":"Cody Trottier - 12"},{"$f":"L11","v":43}]
[null,{"$f":"B12","v":"Carter Smith - 11"},{"$f":"L12","v":44}]
[null,{"$f":"B16","v":"Ryan Ruona - 11"},{"$f":"L16","v":38}]
[null,{"$f":"B17","v":"John Turchi - 10"},{"$f":"L17","v":51}]
[null,{"$f":"B18","v":"Lucas Hass - 11"},{"$f":"L18","v":50}]
[null,{"$f":"B19","v":"Jake Lidwin - 11"},{"$f":"L19","v":50}]
[null,{"$f":"B20","v":"Luke Carroll - 10"},{"$f":"L20","v":57}]
[null,{"$f":"B24","v":"George Kneiser - 11"},{"$f":"L24","v":42}]
[null,{"$f":"B25","v":"Colin Prom - 12"},{"$f":"L25","v":40}]
[null,{"$f":"B26","v":"Allan Moutvic - 12"},{"$f":"L26","v":42}]
[null,{"$f":"B27","v":"Brett Lange - 12"},{"$f":"L27","v":49}]
[null,{"$f":"B28","v":"Sam Hosch - 12"},{"$f":"L28","v":51}]
[null,{"$f":"B32","v":"Austin Walsh - 12"},{"$f":"L32","v":46}]
[null,{"$f":"B33","v":"Jack Burns - 12"},{"$f":"L33","v":39}]
[null,{"$f":"B34","v":"Chris Evans - 11"},{"$f":"L34","v":43}]
[null,{"$f":"B35","v":"Ryan Erdmann - 9"},{"$f":"L35","v":48}]
[null,{"$f":"B36","v":"Howie Wolf - 12"},{"$f":"L36","v":50}]
[null,{"$f":"Q8","v":"Cameron Boyd - 11"},{"$f":"AA8","v":44}]
[null,{"$f":"Q9","v":"Alex Thompson - 9"},{"$f":"AA9","v":45}]
[null,{"$f":"Q10","v":"Collin Travis - 11"},{"$f":"AA10","v":57}]
[null,{"$f":"Q11","v":"Austin Douglas - 10"},{"$f":"AA11","v":50}]
[null,{"$f":"Q12","v":"Dylan Rahfaldt - 9"},{"$f":"AA12","v":58}]
[null,{"$f":"Q16","v":"Devon Hanson - 11"},{"$f":"AA16","v":38}]
[null,{"$f":"Q17","v":"Mitch Saari - 12"},{"$f":"AA17","v":47}]
[null,{"$f":"Q18","v":"Sam Struebing - 11"},{"$f":"AA18","v":49}]
[null,{"$f":"Q19","v":"Josh Breuer - 12"},{"$f":"AA19","v":49}]
[null,{"$f":"Q20","v":"Brad Halverson - 9"},{"$f":"AA20","v":49}]
[null,{"$f":"Q24","v":"Alex Haas - 12"},{"$f":"AA24","v":42}]
[null,{"$f":"Q25","v":"Max Rohlinger - 10"},{"$f":"AA25","v":42}]
[null,{"$f":"Q26","v":"Jacob Droese - 12"},{"$f":"AA26","v":46}]
[null,{"$f":"Q27","v":"Kevin Albrecht - 11"},{"$f":"AA27","v":42}]
[null,{"$f":"Q28","v":"Marvin Bateman  - 11"},{"$f":"AA28","v":45}]
[null,{"$f":"Q32","v":"Zachary Stahle - 11"},{"$f":"AA32","v":47}]
[null,{"$f":"Q33","v":"Ben Krause - 11"},{"$f":"AA33","v":49}]
[null,{"$f":"Q34","v":"Scratch #1 - "},{"$f":"AA34","v":81}]
[null,{"$f":"Q35","v":"Scratch #2 - "},{"$f":"AA35","v":81}]
[null,{"$f":"Q36","v":"Scratch #3 - "},{"$f":"AA36","v":81}]

{"sheet":"WBW","index":1,"n_rows":440,"n_cols":56,"rows_kept":440,"cut":false,"hidden":false,"merged":[[40,16,40,26],[0,2,0,11],[99,2,99,11],[104,2,104,11],[46,1,48,12]]}
[null,"Course:   ","West Bend Country Club"]
[null,"Hole   ",10,11,12,13,14,15,16,17,18,"Total",null,null,null,null,"Hole   ",{"$f":"C2","v":10},11,12,13,14,15,16,17,18,"Total"]
[null,"  Par   ",4,5,4,3,4,5,4,3,4,{"$f":"SUM(C3:K3)","v":36},null,null,null,null,"  Par   ",4,5,4,3,4,5,4,3,4,{"$f":"L3","v":36}]
[null,"Handicap  ",12,4,8,18,14,2,10,16,6,null,null,null,null,null,"Handicap  ",12,4,8,18,14,2,10,16,6]
[]
[]
["Player","BEAVER DAM",null,null,null,null,null,null,null,null,null,null,"Place",null,null,"Player","WATERTOWN",null,null,null,null,null,null,null,null,null,null,"Place"]
[1,"Koby Jones - 12",4,5,3,5,4,7,5,4,5,{"$f":"IF(COUNTBLANK(C8:K8)>0,\"\",SUM(C8:K8))","v":42},{"$f":"VLOOKUP(BA8,$B$301:$E$340,4)","v":6},null,null,1,"Cameron Boyd - 11",6,8,3,3,5,7,5,5,6,{"$f":"IF(COUNTBLANK(R8:Z8)>0,\"\",SUM(R8:Z8))","v":48},{"$f":"VLOOKUP(BB8,$B$301:$E$340,4)","v":24},null,null,null,null,null,null,null,null,null,null,null,null,null,null,null,null,null,null,null,null,null,null,null,null,1,21,{"$f":"LEN(L8)","v":2},{"$f":"LEN(AA8)","v":2}]
[2,"Cody Trottier - ",5,5,5,3,5,6,5,3,6,{"$f":"IF(COUNTBLANK(C9:K9)>0,\"\",SUM(C9:K9))","v":43},{"$f":"VLOOKUP(BA9,$B$301:$E$340,4)","v":7},null,null,2,"Alex Thompson - 9",6,6,8,5,4,5,5,6,5,{"$f":"IF(COUNTBLANK(R9:Z9)>0,\"\",SUM(R9:Z9))","v":50},{"$f":"VLOOKUP(BB9,$B$301:$E$340,4)","v":28},null,null,null,null,null,null,null,null,null,null,null,null,null,null,null,null,null,null,null,null,null,null,null,null,2,22,{"$f":"LEN(L9)","v":2},{"$f":"LEN(AA9)","v":2}]
[3,"Jacob Smith - 10",4,7,5,3,6,6,5,3,7,{"$f":"IF(COUNTBLANK(C10:K10)>0,\"\",SUM(C10:K10))","v":46},{"$f":"VLOOKUP(BA10,$B$301:$E$340,4)","v":18},null,null,3,"Austin Douglas - 10",8,8,7,5,8,8,9,5,6,{"$f":"IF(COUNTBLANK(R10:Z10)>0,\"\",SUM(R10:Z10))","v":64},{"$f":"VLOOKUP(BB10,$B$301:$E$340,4)","v":37},null,null,null,null,null,null,null,null,null,null,null,null,null,null,null,null,null,null,null,null,null,null,null,null,3,23,{"$f":"LEN(L10)","v":2},{"$f":"LEN(AA10)","v":2}]
[4,"Ryan Henning - ",6,6,5,6,5,6,6,5,6,{"$f":"IF(COUNTBLANK(C11:K11)>0,\"\",SUM(C11:K11))","v":51},{"$f":"VLOOKUP(BA11,$B$301:$E$340,4)","v":30},null,null,4,"Collin Travis - 11",6,7,6,3,5,6,4,4,6,{"$f":"IF(COUNTBLANK(R11:Z11)>0,\"\",SUM(R11:Z11))","v":47},{"$f":"VLOOKUP(BB11,$B$301:$E$340,4)","v":19},null,null,null,null,null,null,null,null,null,null,null,null,null,null,null,null,null,null,null,null,null,null,null,null,4,24,{"$f":"LEN(L11)","v":2},{"$f":"LEN(AA11)","v":2}]
[5,"Carter Smith - 11",5,5,5,4,4,6,5,4,6,{"$f":"IF(COUNTBLANK(C12:K12)>0,\"\",SUM(C12:K12))","v":44},{"$f":"VLOOKUP(BA12,$B$301:$E$340,4)","v":10},null,null,5,"Trevor  Reierson - 11",7,8,5,4,7,7,6,5,6,{"$f":"IF(COUNTBLANK(R12:Z12)>0,\"\",SUM(R12:Z12))","v":55},{"$f":"VLOOKUP(BB12,$B$301:$E$340,4)","v":34},null,null,null,null,null,null,null,null,null,null,null,null,null,null,null,null,null,null,null,null,null,null,null,null,5,25,{"$f":"LEN(L12)","v":2},{"$f":"LEN(AA12)","v":2}]
[null,null,null,null,null,null,null,null,null,null,null,{"$f":"IF(COUNT(L8:L12)=5,(SUM(L8:L12))-(MAX(L8:L12)),(IF(COUNT(L8:L12)=4,SUM(L8:L12),IF(COUNTBLANK(L8:L12)>0,SUM(L8:L12),\"DQ\"))))","v":175},{"$f":"J351","v":2},null,null,null,null,null,null,null,null,null,null,null,null,null,{"$f":"IF(COUNT(AA8:AA12)=5,(SUM(AA8:AA12))-(MAX(AA8:AA12)),(IF(COUNT(AA8:AA12)=4,SUM(AA8:AA12),IF(COUNTBLANK(AA8:AA12)>0,SUM(AA8:AA12),\"DQ\"))))","v":200},{"$f":"J355","v":7}]
[null,null,null,null,null,null,null,null,null,null,null,{"$f":"IF(COUNT(L8:L12)=5,MAX(L8:L12),IF(COUNT(L8:L12)<5,200,))","v":51},null,null,null,null,null,null,null,null,null,null,null,null,null,null,{"$f":"IF(COUNT(AA8:AA12)=5,MAX(AA8:AA12),IF(COUNT(AA8:AA12)<5,200,))","v":64}]
["Player","HARTFORD",null,null,null,null,null,null,null,null,null,null,"Place",null,null,"Player","WEST BEND EAST",null,null,null,null,null,null,null,null,null,null,"Place"]
[1,"Ryan Ruona - 11",3,9,3,4,4,6,4,4,6,{"$f":"IF(COUNTBLANK(C16:K16)>0,\"\",SUM(C16:K16))","v":43},{"$f":"VLOOKUP(BA16,$B$301:$E$340,4)","v":7},null,null,1,"Devon Hanson - 11",4,5,4,4,4,5,5,4,6,{"$f":"IF(COUNTBLANK(R16:Z16)>0,\"\",SUM(R16:Z16))","v":41},{"$f":"VLOOKUP(BB16,$B$301:$E$340,4)","v":4},null,null,null,null,null,null,null,null,null,null,null,null,null,null,null,null,null,null,null,null,null,null,null,null,6,26,{"$f":"LEN(L16)","v":2},{"$f":"LEN(AA16)","v":2}]
[2,"Adam Butler - 12",5,4,4,5,7,7,5,4,4,{"$f":"IF(COUNTBLANK(C17:K17)>0,\"\",SUM(C17:K17))","v":45},{"$f":"VLOOKUP(BA17,$B$301:$E$340,4)","v":14},null,null,2,"Mitch Saari - 12",5,4,4,3,4,5,5,4,7,{"$f":"IF(COUNTBLANK(R17:Z17)>0,\"\",SUM(R17:Z17))","v":41},{"$f":"VLOOKUP(BB17,$B$301:$E$340,4)","v":4},null,null,null,null,null,null,null,null,null,null,null,null,null,null,null,null,null,null,null,null,null,null,null,null,7,27,{"$f":"LEN(L17)","v":2},{"$f":"LEN(AA17)","v":2}]
[3,"John Turchi - 10",5,5,5,5,5,7,6,5,5,{"$f":"IF(COUNTBLANK(C18:K18)>0,\"\",SUM(C18:K18))","v":48},{"$f":"VLOOKUP(BA18,$B$301:$E$340,4)","v":24},null,null,3,"Sam Struebing - 11",4,6,7,3,7,6,4,5,6,{"$f":"IF(COUNTBLANK(R18:Z18)>0,\"\",SUM(R18:Z18))","v":48},{"$f":"VLOOKUP(BB18,$B$301:$E$340,4)","v":24},null,null,null,null,null,null,null,null,null,null,null,null,null,null,null,null,null,null,null,null,null,null,null,null,8,28,{"$f":"LEN(L18)","v":2},{"$f":"LEN(AA18)","v":2}]
[4,"Lucas Hass - 11",5,6,5,5,5,6,6,4,7,{"$f":"IF(COUNTBLANK(C19:K19)>0,\"\",SUM(C19:K19))","v":49},{"$f":"VLOOKUP(BA19,$B$301:$E$340,4)","v":27},null,null,4,"Josh Breuer - 12",5,6,6,4,6,6,5,4,5,{"$f":"IF(COUNTBLANK(R19:Z19)>0,\"\",SUM(R19:Z19))","v":47},{"$f":"VLOOKUP(BB19,$B$301:$E$340,4)","v":19},null,null,null,null,null,null,null,null,null,null,null,null,null,null,null,null,null,null,null,null,null,null,null,null,9,29,{"$f":"LEN(L19)","v":2},{"$f":"LEN(AA19)","v":2}]
[5,"Luke Carroll - 10",5,5,6,4,4,7,3,5,6,{"$f":"IF(COUNTBLANK(C20:K20)>0,\"\",SUM(C20:K20))","v":45},{"$f":"VLOOKUP(BA20,$B$301:$E$340,4)","v":14},null,null,5,"Brad Halverson - 9",4,8,5,5,6,6,6,5,5,{"$f":"IF(COUNTBLANK(R20:Z20)>0,\"\",SUM(R20:Z20))","v":50},{"$f":"VLOOKUP(BB20,$B$301:$E$340,4)","v":28},null,null,null,null,null,null,null,null,null,null,null,null,null,null,null,null,null,null,null,null,null,null,null,null,10,30,{"$f":"LEN(L20)","v":2},{"$f":"LEN(AA20)","v":2}]
[null,null,null,null,null,null,null,null,null,null,null,{"$f":"IF(COUNT(L16:L20)=5,(SUM(L16:L20))-(MAX(L16:L20)),(IF(COUNT(L16:L20)=4,SUM(L16:L20),IF(COUNTBLANK(L16:L20)>0,SUM(L16:L20),\"DQ\"))))","v":181},{"$f":"J352","v":5},null,null,null,null,null,null,null,null,null,null,null,null,null,{"$f":"IF(COUNT(AA16:AA20)=5,(SUM(AA16:AA20))-(MAX(AA16:AA20)),(IF(COUNT(AA16:AA20)=4,SUM(AA16:AA20),IF(COUNTBLANK(AA16:AA20)>0,SUM(AA16:AA20),\"DQ\"))))","v":177},{"$f":"J356","v":4}]
[null,null,null,null,null,null,null,null,null,null,null,{"$f":"IF(COUNT(L16:L20)=5,MAX(L16:L20),IF(COUNT(L16:L20)<5,200,))","v":49},null,null,null,null,null,null,null,null,null,null,null,null,null,null,{"$f":"IF(COUNT(AA16:AA20)=5,MAX(AA16:AA20),IF(COUNT(AA16:AA20)<5,200,))","v":50}]
["Player","OCONOMOWOC",null,null,null,null,null,null,null,null,null,null,"Place",null,null,"Player","WEST BEND WEST",null,null,null,null,null,null,null,null,null,null,"Place"]
[1,"George Kneiser - 11",5,8,4,3,4,5,5,5,5,{"$f":"IF(COUNTBLANK(C24:K24)>0,\"\",SUM(C24:K24))","v":44},{"$f":"VLOOKUP(BA24,$B$301:$E$340,4)","v":10},null,null,1,"Alex Haas - 12",4,5,4,3,5,4,4,4,4,{"$f":"IF(COUNTBLANK(R24:Z24)>0,\"\",SUM(R24:Z24))","v":37},{"$f":"VLOOKUP(BB24,$B$301:$E$340,4)","v":1},null,null,null,null,null,null,null,null,null,null,null,null,null,null,null,null,null,null,null,null,null,null,null,null,11,31,{"$f":"LEN(L24)","v":2},{"$f":"LEN(AA24)","v":2}]
[2,"Colin Prom - 12",4,7,4,4,4,6,6,3,6,{"$f":"IF(COUNTBLANK(C25:K25)>0,\"\",SUM(C25:K25))","v":44},{"$f":"VLOOKUP(BA25,$B$301:$E$340,4)","v":10},null,null,2,"Max Rohlinger - 10",4,7,3,4,4,5,5,4,4,{"$f":"IF(COUNTBLANK(R25:Z25)>0,\"\",SUM(R25:Z25))","v":40},{"$f":"VLOOKUP(BB25,$B$301:$E$340,4)","v":2},null,null,null,null,null,null,null,null,null,null,null,null,null,null,null,null,null,null,null,null,null,null,null,null,12,32,{"$f":"LEN(L25)","v":2},{"$f":"LEN(AA25)","v":2}]
[3,"Allan Moutvic - 12",4,6,6,4,4,5,4,3,7,{"$f":"IF(COUNTBLANK(C26:K26)>0,\"\",SUM(C26:K26))","v":43},{"$f":"VLOOKUP(BA26,$B$301:$E$340,4)","v":7},null,null,3,"Jacob Droese - 12",6,8,6,4,5,6,5,3,4,{"$f":"IF(COUNTBLANK(R26:Z26)>0,\"\",SUM(R26:Z26))","v":47},{"$f":"VLOOKUP(BB26,$B$301:$E$340,4)","v":19},null,null,null,null,null,null,null,null,null,null,null,null,null,null,null,null,null,null,null,null,null,null,null,null,13,33,{"$f":"LEN(L26)","v":2},{"$f":"LEN(AA26)","v":2}]
[4,"Brett Lange - 12",5,6,8,4,7,7,6,5,7,{"$f":"IF(COUNTBLANK(C27:K27)>0,\"\",SUM(C27:K27))","v":55},{"$f":"VLOOKUP(BA27,$B$301:$E$340,4)","v":34},null,null,4,"Kevin Albrecht - 11",3,5,4,4,4,6,5,3,6,{"$f":"IF(COUNTBLANK(R27:Z27)>0,\"\",SUM(R27:Z27))","v":40},{"$f":"VLOOKUP(BB27,$B$301:$E$340,4)","v":2},null,null,null,null,null,null,null,null,null,null,null,null,null,null,null,null,null,null,null,null,null,null,null,null,14,34,{"$f":"LEN(L27)","v":2},{"$f":"LEN(AA27)","v":2}]
[5,"Joey Ploch - ",5,5,5,5,3,6,4,4,7,{"$f":"IF(COUNTBLANK(C28:K28)>0,\"\",SUM(C28:K28))","v":44},{"$f":"VLOOKUP(BA28,$B$301:$E$340,4)","v":10},null,null,5,"Nick Meucci - 12",5,5,5,5,5,5,5,4,8,{"$f":"IF(COUNTBLANK(R28:Z28)>0,\"\",SUM(R28:Z28))","v":47},{"$f":"VLOOKUP(BB28,$B$301:$E$340,4)","v":19},null,null,null,null,null,null,null,null,null,null,null,null,null,null,null,null,null,null,null,null,null,null,null,null,15,35,{"$f":"LEN(L28)","v":2},{"$f":"LEN(AA28)","v":2}]
[null,null,null,null,null,null,null,null,null,null,null,{"$f":"IF(COUNT(L24:L28)=5,(SUM(L24:L28))-(MAX(L24:L28)),(IF(COUNT(L24:L28)=4,SUM(L24:L28),IF(COUNTBLANK(L24:L28)>0,SUM(L24:L28),\"DQ\"))))","v":175},{"$f":"J353","v":3},null,null,null,null,null,null,null,null,null,null,null,null,null,{"$f":"IF(COUNT(AA24:AA28)=5,(SUM(AA24:AA28))-(MAX(AA24:AA28)),(IF(COUNT(AA24:AA28)=4,SUM(AA24:AA28),IF(COUNTBLANK(AA24:AA28)>0,SUM(AA24:AA28),\"DQ\"))))","v":164},{"$f":"J357","v":1}]
[null,null,null,null,null,null,null,null,null,null,null,{"$f":"IF(COUNT(L24:L28)=5,MAX(L24:L28),IF(COUNT(L24:L28)<5,200,))","v":55},null,null,null,null,null,null,null,null,null,null,null,null,null,null,{"$f":"IF(COUNT(AA24:AA28)=5,MAX(AA24:AA28),IF(COUNT(AA24:AA28)<5,200,))","v":47}]
["Player","SLINGER",null,null,null,null,null,null,null,null,null,null,"Place",null,null,"Player","WISCONSIN LUTHERAN",null,null,null,null,null,null,null,null,null,null,"Place"]
[1,"Jack Burns - 12",4,7,4,3,5,5,5,4,8,{"$f":"IF(COUNTBLANK(C32:K32)>0,\"\",SUM(C32:K32))","v":45},{"$f":"VLOOKUP(BA32,$B$301:$E$340,4)","v":14},null,null,1,"Zachary Stahle - 11",7,5,4,4,6,6,4,5,6,{"$f":"IF(COUNTBLANK(R32:Z32)>0,\"\",SUM(R32:Z32))","v":47},{"$f":"VLOOKUP(BB32,$B$301:$E$340,4)","v":19},null,null,null,null,null,null,null,null,null,null,null,null,null,null,null,null,null,null,null,null,null,null,null,null,16,36,{"$f":"LEN(L32)","v":2},{"$f":"LEN(AA32)","v":2}]
[2,"Ryan Graunke - 12",7,10,4,4,5,7,4,5,5,{"$f":"IF(COUNTBLANK(C33:K33)>0,\"\",SUM(C33:K33))","v":51},{"$f":"VLOOKUP(BA33,$B$301:$E$340,4)","v":30},null,null,2,"Ben Krause - 11",7,6,4,5,6,8,6,6,5,{"$f":"IF(COUNTBLANK(R33:Z33)>0,\"\",SUM(R33:Z33))","v":53},{"$f":"VLOOKUP(BB33,$B$301:$E$340,4)","v":33},null,null,null,null,null,null,null,null,null,null,null,null,null,null,null,null,null,null,null,null,null,null,null,null,17,37,{"$f":"LEN(L33)","v":2},{"$f":"LEN(AA33)","v":2}]
[3,"Austin Walsh - 12",5,4,4,4,6,5,5,5,7,{"$f":"IF(COUNTBLANK(C34:K34)>0,\"\",SUM(C34:K34))","v":45},{"$f":"VLOOKUP(BA34,$B$301:$E$340,4)","v":14},null,null,3,"Scratch #1 - ",9,9,9,9,9,9,9,9,9,{"$f":"IF(COUNTBLANK(R34:Z34)>0,\"\",SUM(R34:Z34))","v":81},{"$f":"VLOOKUP(BB34,$B$301:$E$340,4)","v":38},null,null,null,null,null,null,null,null,null,null,null,null,null,null,null,null,null,null,null,null,null,null,null,null,18,38,{"$f":"LEN(L34)","v":2},{"$f":"LEN(AA34)","v":2}]
[4,"Chris Evans - 11",5,8,4,5,6,7,6,4,6,{"$f":"IF(COUNTBLANK(C35:K35)>0,\"\",SUM(C35:K35))","v":51},{"$f":"VLOOKUP(BA35,$B$301:$E$340,4)","v":30},null,null,4,"Scratch #2 - ",9,9,9,9,9,9,9,9,9,{"$f":"IF(COUNTBLANK(R35:Z35)>0,\"\",SUM(R35:Z35))","v":81},{"$f":"VLOOKUP(BB35,$B$301:$E$340,4)","v":38},null,null,null,null,null,null,null,null,null,null,null,null,null,null,null,null,null,null,null,null,null,null,null,null,19,39,{"$f":"LEN(L35)","v":2},{"$f":"LEN(AA35)","v":2}]
[5,"Bryan Laude - 12",5,9,6,4,7,7,6,5,7,{"$f":"IF(COUNTBLANK(C36:K36)>0,\"\",SUM(C36:K36))","v":56},{"$f":"VLOOKUP(BA36,$B$301:$E$340,4)","v":36},null,null,5,"Scratch #3 - ",9,9,9,9,9,9,9,9,9,{"$f":"IF(COUNTBLANK(R36:Z36)>0,\"\",SUM(R36:Z36))","v":81},{"$f":"VLOOKUP(BB36,$B$301:$E$340,4)","v":38},null,null,null,null,null,null,null,null,null,null,null,null,null,null,null,null,null,null,null,null,null,null,null,null,20,40,{"$f":"LEN(L36)","v":2},{"$f":"LEN(AA36)","v":2}]
[null,null,null,null,null,null,null,null,null,null,null,{"$f":"IF(COUNT(L32:L36)=5,(SUM(L32:L36))-(MAX(L32:L36)),(IF(COUNT(L32:L36)=4,SUM(L32:L36),IF(COUNTBLANK(L32:L36)>0,SUM(L32:L36),\"DQ\"))))","v":192},{"$f":"J354","v":6},null,null,null,null,null,null,null,null,null,null,null,null,null,{"$f":"IF(COUNT(AA32:AA36)=5,(SUM(AA32:AA36))-(MAX(AA32:AA36)),(IF(COUNT(AA32:AA36)=4,SUM(AA32:AA36),IF(COUNTBLANK(AA32:AA36)>0,SUM(AA32:AA36),\"DQ\"))))","v":262},{"$f":"J358","v":8}]
[null,null,null,null,null,null,null,null,null,null,null,{"$f":"IF(COUNT(L32:L36)=5,MAX(L32:L36),IF(COUNT(L32:L36)<5,200,))","v":56},null,null,null,null,null,null,null,null,null,null,null,null,null,null,{"$f":"IF(COUNT(AA32:AA36)=5,MAX(AA32:AA36),IF(COUNT(AA32:AA36)<5,200,))","v":81}]
[]
[]
[null,"Wisconsin Little Ten Varsity Golf",null,null,null,null,"Match # 2",null,null,null,null,"Hosted By: ","West Bend West",null,null,null,{"$f":"\"WISCONSIN LITTLE TEN CONFERENCE STANDINGS \" & Schedule!Q41","v":"WISCONSIN LITTLE TEN CONFERENCE STANDINGS "}]
[null,null,null,null,null,null,null,null,null,null,null,null,null,null,null,null,"Match  ","1",2,3,4,5,6,7,8,9,"Total"]
[null,"Date: Apr 20, 2015",null,{"$f":"\"Location: \" & C1","v":"Location: West Bend Country Club"},null,null,null,null,null,null,null,null,null,null,null,null,{"$f":"Rosters!$B$10","v":"West Bend West"},1,1,null,null,null,null,null,null,null,{"$f":"IF(SUM(R43:Z43)=0,\"\",SUM(R43:Z43))","v":2}]
[null,"Weather:  43 and gusty; rain prior to tee off, drizzle for first 1/2 hr",null,null,null,null,null,null,null,null,null,null,null,null,null,null,{"$f":"Rosters!$B$4","v":"Beaver Dam"},3,2,null,null,null,null,null,null,null,5]
[null,null,null,null,null,null,null,null,null,null,null,null,null,null,null,null,{"$f":"Rosters!$B$6","v":"Oconomowoc"},2,3,null,null,null,null,null,null,null,5]
[null,"Medalist:  (37) Alex Haas, WBW ",null,null,null,null,null,null,null,null,null,null,null,null,null,null,{"$f":"Rosters!$B$9","v":"West Bend East"},5,4,null,null,null,null,null,null,null,9]
[null,"Medalist: (37) - Alex Haas",null,null,null,null,null,null,null,null,null,null,null,null,null,null,{"$f":"Rosters!$B$7","v":"Slinger"},4,6,null,null,null,null,null,null,null,10]
[null,null,null,null,null,null,null,null,null,null,null,null,null,null,null,null,{"$f":"Rosters!$B$5","v":"Hartford"},6,5,null,null,null,null,null,null,null,11]
[null,null,null,null,null,null,null,null,null,null,null,null,null,null,null,null,{"$f":"Rosters!$B$8","v":"Watertown"},7,7,null,null,null,null,null,null,null,14]
[null,null,null,null,null,null,null,null,null,null,null,"= Birdies or Better",null,null,null,null,{"$f":"Rosters!$B$11","v":"Wisconsin Lutheran"},8,8,null,null,null,null,null,null,null,16]
[]
[]
[]
[]
[]
[]
[]
[]
[]
[]
[]
[]
[]
[]
[]
[]
[]
[]
[]
[]
[]
[]
[]
[]
[]
[]
[]
[]
[]
[]
[]
[]
[]
[]
[]
[]
[]
[]
[]
[]
[]
[]
[]
[]
[]
[]
[]
[]
[]
[null,"Course:   ","West Bend Country Club"]
[null,"Hole   ",1,2,3,4,5,6,7,8,9,"Total"]
[null,"  Par   ",4,4,5,3,4,5,4,3,4,{"$f":"SUM(C102:K102)","v":36}]
[null,"Handicap  ",13,11,2,15,9,1,7,17,5]
[]
[null,"Course:   ","West Bend Country Club"]
[null,"Hole   ",10,11,12,13,14,15,16,17,18,"Total"]
[null,"  Par   ",4,5,4,3,4,5,4,3,4,{"$f":"SUM(C107:K107)","v":36}]
[null,"Handicap  ",12,4,8,18,14,2,10,16,6]
[]
[]
[]
[]
[]
[]
[]
[]
[]
[]
[]
[]
[]
[]
[]
[]
[]
[]
[]
[]
[]
[]
[]
[]
[]
[]
[]
[]
[]
[]
[]
[]
[]
[]
[]
[]
[]
[]
[]
[]
[]
[]
[]
[]
[]
[]
[]
[]
[]
[]
[]
[]
[]
[]
[]
[]
[]
[]
[]
[]
[]
[]
[]
[]
[]
[]
[]
[]
[]
[]
[]
[]
[]
[]
[]
[]
[]
[]
[]
[]
[]
[]
[]
[]
[]
[]
[]
[]
[]
[]
[]
[]
[]
[]
[]
[]
[]
[]
[]
[]
[]
[]
[]
[]
[]
[]
[]
[]
[]
[]
[]
[]
[]
[]
[]
[]
[]
[]
[]
[]
[]
[]
[]
[]
[]
[]
[]
[]
[]
[]
[]
[]
[]
[]
[]
[]
[]
[]
[]
[]
[]
[]
[]
[]
[]
[]
[]
[]
[]
[]
[]
[]
[]
[]
[]
[]
[]
[]
[]
[]
[]
[]
[]
[]
[]
[]
[]
[]
[]
[]
[]
[]
[]
[]
[]
[]
[]
[]
[]
[]
[]
[]
[]
[]
[]
[]
[]
[]
[]
[]
[]
[null,"Player","Sc","Sort","Rnk"]
[null,1,{"$f":"$L$8","v":42},null,6]
[null,2,{"$f":"$L$9","v":43},null,7]
[null,3,{"$f":"$L$10","v":46},null,18]
[null,4,{"$f":"$L$11","v":51},null,30]
[null,5,{"$f":"$L$12","v":44},null,10]
[null,6,{"$f":"$L$16","v":43},null,7]
[null,7,{"$f":"$L$17","v":45},null,14]
[null,8,{"$f":"$L$18","v":48},null,24]
[null,9,{"$f":"$L$19","v":49},null,27]
[null,10,{"$f":"$L$20","v":45},null,14]
[null,11,{"$f":"$L$24","v":44},null,10]
[null,12,{"$f":"$L$25","v":44},null,10]
[null,13,{"$f":"$L$26","v":43},null,7]
[null,14,{"$f":"$L$27","v":55},null,34]
[null,15,{"$f":"$L$28","v":44},null,10]
[null,16,{"$f":"$L$32","v":45},null,14]
[null,17,{"$f":"$L$33","v":51},null,30]
[null,18,{"$f":"$L$34","v":45},null,14]
[null,19,{"$f":"$L$35","v":51},null,30]
[null,20,{"$f":"$L$36","v":56},null,36]
[null,21,{"$f":"$AA$8","v":48},null,24]
[null,22,{"$f":"$AA$9","v":50},null,28]
[null,23,{"$f":"$AA$10","v":64},null,37]
[null,24,{"$f":"$AA$11","v":47},null,19]
[null,25,{"$f":"$AA$12","v":55},null,34]
[null,26,{"$f":"$AA$16","v":41},null,4]
[null,27,{"$f":"$AA$17","v":41},null,4]
[null,28,{"$f":"$AA$18","v":48},null,24]
[null,29,{"$f":"$AA$19","v":47},null,19]
[null,30,{"$f":"$AA$20","v":50},null,28]
[null,31,{"$f":"$AA$24","v":37},null,1]
[null,32,{"$f":"$AA$25","v":40},null,2]
[null,33,{"$f":"$AA$26","v":47},null,19]
[null,34,{"$f":"$AA$27","v":40},null,2]
[null,35,{"$f":"$AA$28","v":47},null,19]
[null,36,{"$f":"$AA$32","v":47},null,19]
[null,37,{"$f":"$AA$33","v":53},null,33]
[null,38,{"$f":"$AA$34","v":81},null,38]
[null,39,{"$f":"$AA$35","v":81},null,38]
[null,40,{"$f":"$AA$36","v":81},null,38]
[null,{"$f":"B69","v":0}]
[null,{"$f":"B70","v":0}]
[null,{"$f":"B71","v":0}]
[]
[]
[]
[]
[]
[null,null,null,null,null,null,null,null,null,{"$f":"DCOUNT(J350:J358,1,J347:J348)","v":8}]
[null,null,1,2,3,4,5,null,"Tot","Rank"]
[null,"Team1",{"$f":"$L$8","v":42},{"$f":"$L$9","v":43},{"$f":"$L$10","v":46},{"$f":"$L$11","v":51},{"$f":"$L$12","v":44},{"$f":"$L$14","v":51},{"$f":"$L$13","v":175},2,null,2,null,null,null,null,null,0,0,0,0,0,0,0,0,0]
[null,"Team2",{"$f":"$L$16","v":43},{"$f":"$L$17","v":45},{"$f":"$L$18","v":48},{"$f":"$L$19","v":49},{"$f":"$L$20","v":45},{"$f":"$L$22","v":49},{"$f":"$L$21","v":181},5,null,5,null,null,null,null,null,0,0,0,0,0,0,0,0,0]
[null,"Team3",{"$f":"$L$24","v":44},{"$f":"$L$25","v":44},{"$f":"$L$26","v":43},{"$f":"$L$27","v":55},{"$f":"$L$28","v":44},{"$f":"$L$30","v":55},{"$f":"$L$29","v":175},3,null,3,null,null,null,null,null,0,0,0,0,0,0,0,0,0]
[null,"Team4",{"$f":"$L$32","v":45},{"$f":"$L$33","v":51},{"$f":"$L$34","v":45},{"$f":"$L$35","v":51},{"$f":"$L$36","v":56},{"$f":"$L$38","v":56},{"$f":"$L$37","v":192},6,null,6,null,null,null,null,null,0,0,0,0,0,0,0,0,0]
[null,"Team5",{"$f":"$AA$8","v":48},{"$f":"$AA$9","v":50},{"$f":"$AA$10","v":64},{"$f":"$AA$11","v":47},{"$f":"$AA$12","v":55},{"$f":"$AA$14","v":64},{"$f":"$AA$13","v":200},7,null,7,null,null,null,null,null,0,0,0,0,0,0,0,0,0]
[null,"Team6",{"$f":"$AA$16","v":41},{"$f":"$AA$17","v":41},{"$f":"$AA$18","v":48},{"$f":"$AA$19","v":47},{"$f":"$AA$20","v":50},{"$f":"$AA$22","v":50},{"$f":"$AA$21","v":177},4,null,4,null,null,null,null,null,0,0,0,0,0,0,0,0,0]
[null,"Team7",{"$f":"$AA$24","v":37},{"$f":"$AA$25","v":40},{"$f":"$AA$26","v":47},{"$f":"$AA$27","v":40},{"$f":"$AA$28","v":47},{"$f":"$AA$30","v":47},{"$f":"$AA$29","v":164},1,null,1,null,null,null,null,null,0,0,0,0,0,0,0,0,0]
[null,"Team8",{"$f":"$AA$32","v":47},{"$f":"$AA$33","v":53},{"$f":"$AA$34","v":81},{"$f":"$AA$35","v":81},{"$f":"$AA$36","v":81},{"$f":"$AA$38","v":81},{"$f":"$AA$37","v":262},8,null,8,null,null,null,null,null,0,0,0,0,0,0,0,0,0]
[]
[]
[]
[]
[]
[]
[]
[]
[]
[]
[]
[]
[]
[]
[]
[]
[]
[]
[]
[]
[]
[]
[]
[]
[]
[]
[]
[]
[]
[]
[]
[]
[]
[]
[]
[]
[]
[]
[]
[]
[]
[]
[null,{"$f":"B8","v":"Koby Jones - 12"},{"$f":"L8","v":42}]
[null,{"$f":"B9","v":"Cody Trottier - "},{"$f":"L9","v":43}]
[null,{"$f":"B10","v":"Jacob Smith - 10"},{"$f":"L10","v":46}]
[null,{"$f":"B11","v":"Ryan Henning - "},{"$f":"L11","v":51}]
[null,{"$f":"B12","v":"Carter Smith - 11"},{"$f":"L12","v":44}]
[null,{"$f":"B16","v":"Ryan Ruona - 11"},{"$f":"L16","v":43}]
[null,{"$f":"B17","v":"Adam Butler - 12"},{"$f":"L17","v":45}]
[null,{"$f":"B18","v":"John Turchi - 10"},{"$f":"L18","v":48}]
[null,{"$f":"B19","v":"Lucas Hass - 11"},{"$f":"L19","v":49}]
[null,{"$f":"B20","v":"Luke Carroll - 10"},{"$f":"L20","v":45}]
[null,{"$f":"B24","v":"George Kneiser - 11"},{"$f":"L24","v":44}]
[null,{"$f":"B25","v":"Colin Prom - 12"},{"$f":"L25","v":44}]
[null,{"$f":"B26","v":"Allan Moutvic - 12"},{"$f":"L26","v":43}]
[null,{"$f":"B27","v":"Brett Lange - 12"},{"$f":"L27","v":55}]
[null,{"$f":"B28","v":"Joey Ploch - "},{"$f":"L28","v":44}]
[null,{"$f":"B32","v":"Jack Burns - 12"},{"$f":"L32","v":45}]
[null,{"$f":"B33","v":"Ryan Graunke - 12"},{"$f":"L33","v":51}]
[null,{"$f":"B34","v":"Austin Walsh - 12"},{"$f":"L34","v":45}]
[null,{"$f":"B35","v":"Chris Evans - 11"},{"$f":"L35","v":51}]
[null,{"$f":"B36","v":"Bryan Laude - 12"},{"$f":"L36","v":56}]
[null,{"$f":"Q8","v":"Cameron Boyd - 11"},{"$f":"AA8","v":48}]
[null,{"$f":"Q9","v":"Alex Thompson - 9"},{"$f":"AA9","v":50}]
[null,{"$f":"Q10","v":"Austin Douglas - 10"},{"$f":"AA10","v":64}]
[null,{"$f":"Q11","v":"Collin Travis - 11"},{"$f":"AA11","v":47}]
[null,{"$f":"Q12","v":"Trevor  Reierson - 11"},{"$f":"AA12","v":55}]
[null,{"$f":"Q16","v":"Devon Hanson - 11"},{"$f":"AA16","v":41}]
[null,{"$f":"Q17","v":"Mitch Saari - 12"},{"$f":"AA17","v":41}]
[null,{"$f":"Q18","v":"Sam Struebing - 11"},{"$f":"AA18","v":48}]
[null,{"$f":"Q19","v":"Josh Breuer - 12"},{"$f":"AA19","v":47}]
[null,{"$f":"Q20","v":"Brad Halverson - 9"},{"$f":"AA20","v":50}]
[null,{"$f":"Q24","v":"Alex Haas - 12"},{"$f":"AA24","v":37}]
[null,{"$f":"Q25","v":"Max Rohlinger - 10"},{"$f":"AA25","v":40}]
[null,{"$f":"Q26","v":"Jacob Droese - 12"},{"$f":"AA26","v":47}]
[null,{"$f":"Q27","v":"Kevin Albrecht - 11"},{"$f":"AA27","v":40}]
[null,{"$f":"Q28","v":"Nick Meucci - 12"},{"$f":"AA28","v":47}]
[null,{"$f":"Q32","v":"Zachary Stahle - 11"},{"$f":"AA32","v":47}]
[null,{"$f":"Q33","v":"Ben Krause - 11"},{"$f":"AA33","v":53}]
[null,{"$f":"Q34","v":"Scratch #1 - "},{"$f":"AA34","v":81}]
[null,{"$f":"Q35","v":"Scratch #2 - "},{"$f":"AA35","v":81}]
[null,{"$f":"Q36","v":"Scratch #3 - "},{"$f":"AA36","v":81}]

{"sheet":"WBE","index":2,"n_rows":440,"n_cols":56,"rows_kept":440,"cut":false,"hidden":false,"merged":[[40,16,40,26],[0,2,0,11],[99,2,99,11],[104,2,104,11],[46,1,48,12]]}
[null,"Course:   ","West Bend Country Club"]
[null,"Hole   ",1,2,3,4,5,6,7,8,9,"Total",null,null,null,null,"Hole   ",{"$f":"C2","v":1},2,3,4,5,6,7,8,9,"Total"]
[null,"  Par   ",4,4,5,3,4,5,4,3,4,{"$f":"SUM(C3:K3)","v":36},null,null,null,null,"  Par   ",4,4,5,3,4,5,4,3,4,{"$f":"L3","v":36}]
[null,"Handicap  ",13,11,2,15,9,1,7,17,5,null,null,null,null,null,"Handicap  ",13,11,2,15,9,1,7,17,5]
[]
[]
["Player","BEAVER DAM",null,null,null,null,null,null,null,null,null,null,"Place",null,null,"Player","WATERTOWN",null,null,null,null,null,null,null,null,null,null,"Place"]
[1,"Koby Jones - 12",4,6,5,3,5,5,5,3,4,{"$f":"IF(COUNTBLANK(C8:K8)>0,\"\",SUM(C8:K8))","v":40},{"$f":"VLOOKUP(BA8,$B$301:$E$340,4)","v":2},null,null,1,"Cameron Boyd - 11",6,6,5,5,5,5,5,4,5,{"$f":"IF(COUNTBLANK(R8:Z8)>0,\"\",SUM(R8:Z8))","v":46},{"$f":"VLOOKUP(BB8,$B$301:$E$340,4)","v":17},null,null,null,null,null,null,null,null,null,null,null,null,null,null,null,null,null,null,null,null,null,null,null,null,1,21,{"$f":"LEN(L8)","v":2},{"$f":"LEN(AA8)","v":2}]
[2,"Cody Trottier - ",6,6,5,4,5,5,6,4,7,{"$f":"IF(COUNTBLANK(C9:K9)>0,\"\",SUM(C9:K9))","v":48},{"$f":"VLOOKUP(BA9,$B$301:$E$340,4)","v":22},null,null,2,"Alex Thompson - 9",6,4,4,5,5,7,7,6,8,{"$f":"IF(COUNTBLANK(R9:Z9)>0,\"\",SUM(R9:Z9))","v":52},{"$f":"VLOOKUP(BB9,$B$301:$E$340,4)","v":31},null,null,null,null,null,null,null,null,null,null,null,null,null,null,null,null,null,null,null,null,null,null,null,null,2,22,{"$f":"LEN(L9)","v":2},{"$f":"LEN(AA9)","v":2}]
[3,"Thomas Bleich - 11",5,6,6,4,4,5,6,4,4,{"$f":"IF(COUNTBLANK(C10:K10)>0,\"\",SUM(C10:K10))","v":44},{"$f":"VLOOKUP(BA10,$B$301:$E$340,4)","v":10},null,null,3,"Collin Travis - 11",4,6,8,5,6,6,5,3,5,{"$f":"IF(COUNTBLANK(R10:Z10)>0,\"\",SUM(R10:Z10))","v":48},{"$f":"VLOOKUP(BB10,$B$301:$E$340,4)","v":22},null,null,null,null,null,null,null,null,null,null,null,null,null,null,null,null,null,null,null,null,null,null,null,null,3,23,{"$f":"LEN(L10)","v":2},{"$f":"LEN(AA10)","v":2}]
[4,"Ryan Henning - ",4,6,7,5,8,7,5,5,4,{"$f":"IF(COUNTBLANK(C11:K11)>0,\"\",SUM(C11:K11))","v":51},{"$f":"VLOOKUP(BA11,$B$301:$E$340,4)","v":29},null,null,4,"Austin Douglas - 10",5,6,7,4,4,6,5,5,6,{"$f":"IF(COUNTBLANK(R11:Z11)>0,\"\",SUM(R11:Z11))","v":48},{"$f":"VLOOKUP(BB11,$B$301:$E$340,4)","v":22},null,null,null,null,null,null,null,null,null,null,null,null,null,null,null,null,null,null,null,null,null,null,null,null,4,24,{"$f":"LEN(L11)","v":2},{"$f":"LEN(AA11)","v":2}]
[5,"Carter Smith - 11",5,6,6,4,5,7,6,7,5,{"$f":"IF(COUNTBLANK(C12:K12)>0,\"\",SUM(C12:K12))","v":51},{"$f":"VLOOKUP(BA12,$B$301:$E$340,4)","v":29},null,null,5,"Trevor  Reierson - 11",5,7,10,4,6,6,5,7,5,{"$f":"IF(COUNTBLANK(R12:Z12)>0,\"\",SUM(R12:Z12))","v":55},{"$f":"VLOOKUP(BB12,$B$301:$E$340,4)","v":34},null,null,null,null,null,null,null,null,null,null,null,null,null,null,null,null,null,null,null,null,null,null,null,null,5,25,{"$f":"LEN(L12)","v":2},{"$f":"LEN(AA12)","v":2}]
[null,null,null,null,null,null,null,null,null,null,null,{"$f":"IF(COUNT(L8:L12)=5,(SUM(L8:L12))-(MAX(L8:L12)),(IF(COUNT(L8:L12)=4,SUM(L8:L12),IF(COUNTBLANK(L8:L12)>0,SUM(L8:L12),\"DQ\"))))","v":183},{"$f":"J351","v":4},null,null,null,null,null,null,null,null,null,null,null,null,null,{"$f":"IF(COUNT(AA8:AA12)=5,(SUM(AA8:AA12))-(MAX(AA8:AA12)),(IF(COUNT(AA8:AA12)=4,SUM(AA8:AA12),IF(COUNTBLANK(AA8:AA12)>0,SUM(AA8:AA12),\"DQ\"))))","v":194},{"$f":"J355","v":7}]
[null,null,null,null,null,null,null,null,null,null,null,{"$f":"IF(COUNT(L8:L12)=5,MAX(L8:L12),IF(COUNT(L8:L12)<5,200,))","v":51},null,null,null,null,null,null,null,null,null,null,null,null,null,null,{"$f":"IF(COUNT(AA8:AA12)=5,MAX(AA8:AA12),IF(COUNT(AA8:AA12)<5,200,))","v":55}]
["Player","HARTFORD",null,null,null,null,null,null,null,null,null,null,"Place",null,null,"Player","WEST BEND EAST",null,null,null,null,null,null,null,null,null,null,"Place"]
[1,"Ryan Ruona - 11",6,5,5,6,4,7,5,4,4,{"$f":"IF(COUNTBLANK(C16:K16)>0,\"\",SUM(C16:K16))","v":46},{"$f":"VLOOKUP(BA16,$B$301:$E$340,4)","v":17},null,null,1,"Devon Hanson - 11",5,4,5,4,4,5,6,4,4,{"$f":"IF(COUNTBLANK(R16:Z16)>0,\"\",SUM(R16:Z16))","v":41},{"$f":"VLOOKUP(BB16,$B$301:$E$340,4)","v":4},null,null,null,null,null,null,null,null,null,null,null,null,null,null,null,null,null,null,null,null,null,null,null,null,6,26,{"$f":"LEN(L16)","v":2},{"$f":"LEN(AA16)","v":2}]
[2,"Adam Butler - 12",5,6,6,4,5,5,5,6,4,{"$f":"IF(COUNTBLANK(C17:K17)>0,\"\",SUM(C17:K17))","v":46},{"$f":"VLOOKUP(BA17,$B$301:$E$340,4)","v":17},null,null,2,"Mitch Saari - 12",6,5,5,3,4,6,3,4,4,{"$f":"IF(COUNTBLANK(R17:Z17)>0,\"\",SUM(R17:Z17))","v":40},{"$f":"VLOOKUP(BB17,$B$301:$E$340,4)","v":2},null,null,null,null,null,null,null,null,null,null,null,null,null,null,null,null,null,null,null,null,null,null,null,null,7,27,{"$f":"LEN(L17)","v":2},{"$f":"LEN(AA17)","v":2}]
[3,"John Turchi - 10",6,5,6,4,4,6,6,4,6,{"$f":"IF(COUNTBLANK(C18:K18)>0,\"\",SUM(C18:K18))","v":47},{"$f":"VLOOKUP(BA18,$B$301:$E$340,4)","v":20},null,null,3,"Sam Struebing - 11",7,7,6,4,6,5,10,5,6,{"$f":"IF(COUNTBLANK(R18:Z18)>0,\"\",SUM(R18:Z18))","v":56},{"$f":"VLOOKUP(BB18,$B$301:$E$340,4)","v":36},null,null,null,null,null,null,null,null,null,null,null,null,null,null,null,null,null,null,null,null,null,null,null,null,8,28,{"$f":"LEN(L18)","v":2},{"$f":"LEN(AA18)","v":2}]
[4,"Lucas Hass - 11",5,5,5,3,7,6,5,5,4,{"$f":"IF(COUNTBLANK(C19:K19)>0,\"\",SUM(C19:K19))","v":45},{"$f":"VLOOKUP(BA19,$B$301:$E$340,4)","v":13},null,null,4,"Josh Breuer - 12",5,5,7,4,5,7,6,4,5,{"$f":"IF(COUNTBLANK(R19:Z19)>0,\"\",SUM(R19:Z19))","v":48},{"$f":"VLOOKUP(BB19,$B$301:$E$340,4)","v":22},null,null,null,null,null,null,null,null,null,null,null,null,null,null,null,null,null,null,null,null,null,null,null,null,9,29,{"$f":"LEN(L19)","v":2},{"$f":"LEN(AA19)","v":2}]
[5,"Luke Carroll - 10",5,6,6,4,5,6,7,4,5,{"$f":"IF(COUNTBLANK(C20:K20)>0,\"\",SUM(C20:K20))","v":48},{"$f":"VLOOKUP(BA20,$B$301:$E$340,4)","v":22},null,null,5,"Brad Halverson - 9",6,7,8,5,6,6,7,3,7,{"$f":"IF(COUNTBLANK(R20:Z20)>0,\"\",SUM(R20:Z20))","v":55},{"$f":"VLOOKUP(BB20,$B$301:$E$340,4)","v":34},null,null,null,null,null,null,null,null,null,null,null,null,null,null,null,null,null,null,null,null,null,null,null,null,10,30,{"$f":"LEN(L20)","v":2},{"$f":"LEN(AA20)","v":2}]
[null,null,null,null,null,null,null,null,null,null,null,{"$f":"IF(COUNT(L16:L20)=5,(SUM(L16:L20))-(MAX(L16:L20)),(IF(COUNT(L16:L20)=4,SUM(L16:L20),IF(COUNTBLANK(L16:L20)>0,SUM(L16:L20),\"DQ\"))))","v":184},{"$f":"J352","v":5},null,null,null,null,null,null,null,null,null,null,null,null,null,{"$f":"IF(COUNT(AA16:AA20)=5,(SUM(AA16:AA20))-(MAX(AA16:AA20)),(IF(COUNT(AA16:AA20)=4,SUM(AA16:AA20),IF(COUNTBLANK(AA16:AA20)>0,SUM(AA16:AA20),\"DQ\"))))","v":184},{"$f":"J356","v":6}]
[null,null,null,null,null,null,null,null,null,null,null,{"$f":"IF(COUNT(L16:L20)=5,MAX(L16:L20),IF(COUNT(L16:L20)<5,200,))","v":48},null,null,null,null,null,null,null,null,null,null,null,null,null,null,{"$f":"IF(COUNT(AA16:AA20)=5,MAX(AA16:AA20),IF(COUNT(AA16:AA20)<5,200,))","v":56}]
["Player","OCONOMOWOC",null,null,null,null,null,null,null,null,null,null,"Place",null,null,"Player","WEST BEND WEST",null,null,null,null,null,null,null,null,null,null,"Place"]
[1,"George Kneiser - 11",4,4,5,4,5,6,6,3,5,{"$f":"IF(COUNTBLANK(C24:K24)>0,\"\",SUM(C24:K24))","v":42},{"$f":"VLOOKUP(BA24,$B$301:$E$340,4)","v":5},null,null,1,"Alex Haas - 12",4,4,6,4,4,5,7,4,5,{"$f":"IF(COUNTBLANK(R24:Z24)>0,\"\",SUM(R24:Z24))","v":43},{"$f":"VLOOKUP(BB24,$B$301:$E$340,4)","v":6},null,null,null,null,null,null,null,null,null,null,null,null,null,null,null,null,null,null,null,null,null,null,null,null,11,31,{"$f":"LEN(L24)","v":2},{"$f":"LEN(AA24)","v":2}]
[2,"Colin Prom - 12",5,5,5,4,5,6,7,5,6,{"$f":"IF(COUNTBLANK(C25:K25)>0,\"\",SUM(C25:K25))","v":48},{"$f":"VLOOKUP(BA25,$B$301:$E$340,4)","v":22},null,null,2,"Max Rohlinger - 10",4,5,5,4,6,5,5,3,6,{"$f":"IF(COUNTBLANK(R25:Z25)>0,\"\",SUM(R25:Z25))","v":43},{"$f":"VLOOKUP(BB25,$B$301:$E$340,4)","v":6},null,null,null,null,null,null,null,null,null,null,null,null,null,null,null,null,null,null,null,null,null,null,null,null,12,32,{"$f":"LEN(L25)","v":2},{"$f":"LEN(AA25)","v":2}]
[3,"Allan Moutvic - 12",8,5,6,4,6,5,9,6,5,{"$f":"IF(COUNTBLANK(C26:K26)>0,\"\",SUM(C26:K26))","v":54},{"$f":"VLOOKUP(BA26,$B$301:$E$340,4)","v":33},null,null,3,"Kevin Albrecht - 11",7,5,5,4,6,6,4,3,5,{"$f":"IF(COUNTBLANK(R26:Z26)>0,\"\",SUM(R26:Z26))","v":45},{"$f":"VLOOKUP(BB26,$B$301:$E$340,4)","v":13},null,null,null,null,null,null,null,null,null,null,null,null,null,null,null,null,null,null,null,null,null,null,null,null,13,33,{"$f":"LEN(L26)","v":2},{"$f":"LEN(AA26)","v":2}]
[4,"Brett Lange - 12",4,7,5,4,6,6,5,4,4,{"$f":"IF(COUNTBLANK(C27:K27)>0,\"\",SUM(C27:K27))","v":45},{"$f":"VLOOKUP(BA27,$B$301:$E$340,4)","v":13},null,null,4,"Jacob Droese - 12",4,5,6,4,5,6,5,3,5,{"$f":"IF(COUNTBLANK(R27:Z27)>0,\"\",SUM(R27:Z27))","v":43},{"$f":"VLOOKUP(BB27,$B$301:$E$340,4)","v":6},null,null,null,null,null,null,null,null,null,null,null,null,null,null,null,null,null,null,null,null,null,null,null,null,14,34,{"$f":"LEN(L27)","v":2},{"$f":"LEN(AA27)","v":2}]
[5,"Joey Ploch - ",4,5,6,3,5,5,7,4,5,{"$f":"IF(COUNTBLANK(C28:K28)>0,\"\",SUM(C28:K28))","v":44},{"$f":"VLOOKUP(BA28,$B$301:$E$340,4)","v":10},null,null,5,"Nick Meucci - 12",4,5,6,4,5,7,5,4,5,{"$f":"IF(COUNTBLANK(R28:Z28)>0,\"\",SUM(R28:Z28))","v":45},{"$f":"VLOOKUP(BB28,$B$301:$E$340,4)","v":13},null,null,null,null,null,null,null,null,null,null,null,null,null,null,null,null,null,null,null,null,null,null,null,null,15,35,{"$f":"LEN(L28)","v":2},{"$f":"LEN(AA28)","v":2}]
[null,null,null,null,null,null,null,null,null,null,null,{"$f":"IF(COUNT(L24:L28)=5,(SUM(L24:L28))-(MAX(L24:L28)),(IF(COUNT(L24:L28)=4,SUM(L24:L28),IF(COUNTBLANK(L24:L28)>0,SUM(L24:L28),\"DQ\"))))","v":179},{"$f":"J353","v":3},null,null,null,null,null,null,null,null,null,null,null,null,null,{"$f":"IF(COUNT(AA24:AA28)=5,(SUM(AA24:AA28))-(MAX(AA24:AA28)),(IF(COUNT(AA24:AA28)=4,SUM(AA24:AA28),IF(COUNTBLANK(AA24:AA28)>0,SUM(AA24:AA28),\"DQ\"))))","v":174},{"$f":"J357","v":2}]
[null,null,null,null,null,null,null,null,null,null,null,{"$f":"IF(COUNT(L24:L28)=5,MAX(L24:L28),IF(COUNT(L24:L28)<5,200,))","v":54},null,null,null,null,null,null,null,null,null,null,null,null,null,null,{"$f":"IF(COUNT(AA24:AA28)=5,MAX(AA24:AA28),IF(COUNT(AA24:AA28)<5,200,))","v":45}]
["Player","SLINGER",null,null,null,null,null,null,null,null,null,null,"Place",null,null,"Player","WISCONSIN LUTHERAN",null,null,null,null,null,null,null,null,null,null,"Place"]
[1,"Jack Burns - 12",6,6,5,4,5,6,7,3,5,{"$f":"IF(COUNTBLANK(C32:K32)>0,\"\",SUM(C32:K32))","v":47},{"$f":"VLOOKUP(BA32,$B$301:$E$340,4)","v":20},null,null,1,"Zachary Stahle - 12",10,8,5,4,6,5,4,6,8,{"$f":"IF(COUNTBLANK(R32:Z32)>0,\"\",SUM(R32:Z32))","v":56},{"$f":"VLOOKUP(BB32,$B$301:$E$340,4)","v":36},null,null,null,null,null,null,null,null,null,null,null,null,null,null,null,null,null,null,null,null,null,null,null,null,16,36,{"$f":"LEN(L32)","v":2},{"$f":"LEN(AA32)","v":2}]
[2,"Ryan Graunke - 12",5,6,5,4,7,6,6,6,5,{"$f":"IF(COUNTBLANK(C33:K33)>0,\"\",SUM(C33:K33))","v":50},{"$f":"VLOOKUP(BA33,$B$301:$E$340,4)","v":28},null,null,2,"Ben Krause - 12",6,5,5,4,6,10,7,3,7,{"$f":"IF(COUNTBLANK(R33:Z33)>0,\"\",SUM(R33:Z33))","v":53},{"$f":"VLOOKUP(BB33,$B$301:$E$340,4)","v":32},null,null,null,null,null,null,null,null,null,null,null,null,null,null,null,null,null,null,null,null,null,null,null,null,17,37,{"$f":"LEN(L33)","v":2},{"$f":"LEN(AA33)","v":2}]
[3,"Austin Walsh - 12",4,6,4,2,3,6,2,3,4,{"$f":"IF(COUNTBLANK(C34:K34)>0,\"\",SUM(C34:K34))","v":34},{"$f":"VLOOKUP(BA34,$B$301:$E$340,4)","v":1},null,null,3,"Scratch #1 - x",9,9,9,9,9,9,9,9,9,{"$f":"IF(COUNTBLANK(R34:Z34)>0,\"\",SUM(R34:Z34))","v":81},{"$f":"VLOOKUP(BB34,$B$301:$E$340,4)","v":38},null,null,null,null,null,null,null,null,null,null,null,null,null,null,null,null,null,null,null,null,null,null,null,null,18,38,{"$f":"LEN(L34)","v":2},{"$f":"LEN(AA34)","v":2}]
[4,"Chris Evans - 11",5,6,6,3,4,5,5,5,4,{"$f":"IF(COUNTBLANK(C35:K35)>0,\"\",SUM(C35:K35))","v":43},{"$f":"VLOOKUP(BA35,$B$301:$E$340,4)","v":6},null,null,4,"Scratch #2 - x",9,9,9,9,9,9,9,9,9,{"$f":"IF(COUNTBLANK(R35:Z35)>0,\"\",SUM(R35:Z35))","v":81},{"$f":"VLOOKUP(BB35,$B$301:$E$340,4)","v":38},null,null,null,null,null,null,null,null,null,null,null,null,null,null,null,null,null,null,null,null,null,null,null,null,19,39,{"$f":"LEN(L35)","v":2},{"$f":"LEN(AA35)","v":2}]
[5,"Ryan Kusek - 9",5,5,6,5,4,6,5,3,5,{"$f":"IF(COUNTBLANK(C36:K36)>0,\"\",SUM(C36:K36))","v":44},{"$f":"VLOOKUP(BA36,$B$301:$E$340,4)","v":10},null,null,5,"Scratch #3 - x",9,9,9,9,9,9,9,9,9,{"$f":"IF(COUNTBLANK(R36:Z36)>0,\"\",SUM(R36:Z36))","v":81},{"$f":"VLOOKUP(BB36,$B$301:$E$340,4)","v":38},null,null,null,null,null,null,null,null,null,null,null,null,null,null,null,null,null,null,null,null,null,null,null,null,20,40,{"$f":"LEN(L36)","v":2},{"$f":"LEN(AA36)","v":2}]
[null,null,null,null,null,null,null,null,null,null,null,{"$f":"IF(COUNT(L32:L36)=5,(SUM(L32:L36))-(MAX(L32:L36)),(IF(COUNT(L32:L36)=4,SUM(L32:L36),IF(COUNTBLANK(L32:L36)>0,SUM(L32:L36),\"DQ\"))))","v":168},{"$f":"J354","v":1},null,null,null,null,null,null,null,null,null,null,null,null,null,{"$f":"IF(COUNT(AA32:AA36)=5,(SUM(AA32:AA36))-(MAX(AA32:AA36)),(IF(COUNT(AA32:AA36)=4,SUM(AA32:AA36),IF(COUNTBLANK(AA32:AA36)>0,SUM(AA32:AA36),\"DQ\"))))","v":271},{"$f":"J358","v":8}]
[null,null,null,null,null,null,null,null,null,null,null,{"$f":"IF(COUNT(L32:L36)=5,MAX(L32:L36),IF(COUNT(L32:L36)<5,200,))","v":50},null,null,null,null,null,null,null,null,null,null,null,null,null,null,{"$f":"IF(COUNT(AA32:AA36)=5,MAX(AA32:AA36),IF(COUNT(AA32:AA36)<5,200,))","v":81}]
[]
[]
[null,"Wisconsin Little Ten Varsity Golf",null,null,null,null,"Match # 3",null,null,null,null,"Hosted By: ","West Bend East",null,null,null,{"$f":"\"WISCONSIN LITTLE TEN CONFERENCE STANDINGS \" & Schedule!Q41","v":"WISCONSIN LITTLE TEN CONFERENCE STANDINGS "}]
[null,null,null,null,null,null,null,null,null,null,null,null,null,null,null,null,"Match  ","1",2,3,4,5,6,7,8,9,"Total"]
[null,"Date: Apr 27, 2015",null,{"$f":"\"Location: \" & C1","v":"Location: West Bend Country Club"},null,null,null,null,null,null,null,null,null,null,null,null,{"$f":"Rosters!$B$10","v":"West Bend West"},1,1,2,null,null,null,null,null,null,{"$f":"IF(SUM(R43:Z43)=0,\"\",SUM(R43:Z43))","v":4}]
[null,"Weather - 50, sunny, very light breeze ",null,null,null,null,null,null,null,null,null,null,null,null,null,null,{"$f":"Rosters!$B$6","v":"Oconomowoc"},2,3,3,null,null,null,null,null,null,8]
[null,null,null,null,null,null,null,null,null,null,null,null,null,null,null,null,{"$f":"Rosters!$B$4","v":"Beaver Dam"},3,2,4,null,null,null,null,null,null,9]
[null,null,null,null,null,null,null,null,null,null,null,null,null,null,null,null,{"$f":"Rosters!$B$7","v":"Slinger"},4,6,1,null,null,null,null,null,null,11]
[null,"Medalist: (34) - Austin Walsh",null,null,null,null,null,null,null,null,null,null,null,null,null,null,{"$f":"Rosters!$B$9","v":"West Bend East"},5,4,6,null,null,null,null,null,null,15]
[null,null,null,null,null,null,null,null,null,null,null,null,null,null,null,null,{"$f":"Rosters!$B$5","v":"Hartford"},6,5,5,null,null,null,null,null,null,16]
[null,null,null,null,null,null,null,null,null,null,null,null,null,null,null,null,{"$f":"Rosters!$B$8","v":"Watertown"},7,7,7,null,null,null,null,null,null,21]
[null,null,null,null,null,null,null,null,null,null,null,"= Birdies or Better",null,null,null,null,{"$f":"Rosters!$B$11","v":"Wisconsin Lutheran"},8,8,8,null,null,null,null,null,null,24]
[]
[]
[]
[]
[]
[]
[]
[]
[]
[]
[]
[]
[]
[]
[]
[]
[]
[]
[]
[]
[]
[]
[]
[]
[]
[]
[]
[]
[]
[]
[]
[]
[]
[]
[]
[]
[]
[]
[]
[]
[]
[]
[]
[]
[]
[]
[]
[]
[]
[null,"Course:   ","West Bend Country Club"]
[null,"Hole   ",1,2,3,4,5,6,7,8,9,"Total"]
[null,"  Par   ",4,4,5,3,4,5,4,3,4,{"$f":"SUM(C102:K102)","v":36}]
[null,"Handicap  ",13,11,2,15,9,1,7,17,5]
[]
[null,"Course:   ","West Bend Country Club"]
[null,"Hole   ",10,11,12,13,14,15,16,17,18,"Total"]
[null,"  Par   ",4,5,4,3,4,5,4,3,4,{"$f":"SUM(C107:K107)","v":36}]
[null,"Handicap  ",12,4,8,18,14,2,10,16,6]
[]
[]
[]
[]
[]
[]
[]
[]
[]
[]
[]
[]
[]
[]
[]
[]
[]
[]
[]
[]
[]
[]
[]
[]
[]
[]
[]
[]
[]
[]
[]
[]
[]
[]
[]
[]
[]
[]
[]
[]
[]
[]
[]
[]
[]
[]
[]
[]
[]
[]
[]
[]
[]
[]
[]
[]
[]
[]
[]
[]
[]
[]
[]
[]
[]
[]
[]
[]
[]
[]
[]
[]
[]
[]
[]
[]
[]
[]
[]
[]
[]
[]
[]
[]
[]
[]
[]
[]
[]
[]
[]
[]
[]
[]
[]
[]
[]
[]
[]
[]
[]
[]
[]
[]
[]
[]
[]
[]
[]
[]
[]
[]
[]
[]
[]
[]
[]
[]
[]
[]
[]
[]
[]
[]
[]
[]
[]
[]
[]
[]
[]
[]
[]
[]
[]
[]
[]
[]
[]
[]
[]
[]
[]
[]
[]
[]
[]
[]
[]
[]
[]
[]
[]
[]
[]
[]
[]
[]
[]
[]
[]
[]
[]
[]
[]
[]
[]
[]
[]
[]
[]
[]
[]
[]
[]
[]
[]
[]
[]
[]
[]
[]
[]
[]
[]
[]
[]
[]
[]
[]
[]
[null,"Player","Sc","Sort","Rnk"]
[null,1,{"$f":"$L$8","v":40},null,2]
[null,2,{"$f":"$L$9","v":48},null,22]
[null,3,{"$f":"$L$10","v":44},null,10]
[null,4,{"$f":"$L$11","v":51},null,29]
[null,5,{"$f":"$L$12","v":51},null,29]
[null,6,{"$f":"$L$16","v":46},null,17]
[null,7,{"$f":"$L$17","v":46},null,17]
[null,8,{"$f":"$L$18","v":47},null,20]
[null,9,{"$f":"$L$19","v":45},null,13]
[null,10,{"$f":"$L$20","v":48},null,22]
[null,11,{"$f":"$L$24","v":42},null,5]
[null,12,{"$f":"$L$25","v":48},null,22]
[null,13,{"$f":"$L$26","v":54},null,33]
[null,14,{"$f":"$L$27","v":45},null,13]
[null,15,{"$f":"$L$28","v":44},null,10]
[null,16,{"$f":"$L$32","v":47},null,20]
[null,17,{"$f":"$L$33","v":50},null,28]
[null,18,{"$f":"$L$34","v":34},null,1]
[null,19,{"$f":"$L$35","v":43},null,6]
[null,20,{"$f":"$L$36","v":44},null,10]
[null,21,{"$f":"$AA$8","v":46},null,17]
[null,22,{"$f":"$AA$9","v":52},null,31]
[null,23,{"$f":"$AA$10","v":48},null,22]
[null,24,{"$f":"$AA$11","v":48},null,22]
[null,25,{"$f":"$AA$12","v":55},null,34]
[null,26,{"$f":"$AA$16","v":41},null,4]
[null,27,{"$f":"$AA$17","v":40},null,2]
[null,28,{"$f":"$AA$18","v":56},null,36]
[null,29,{"$f":"$AA$19","v":48},null,22]
[null,30,{"$f":"$AA$20","v":55},null,34]
[null,31,{"$f":"$AA$24","v":43},null,6]
[null,32,{"$f":"$AA$25","v":43},null,6]
[null,33,{"$f":"$AA$26","v":45},null,13]
[null,34,{"$f":"$AA$27","v":43},null,6]
[null,35,{"$f":"$AA$28","v":45},null,13]
[null,36,{"$f":"$AA$32","v":56},null,36]
[null,37,{"$f":"$AA$33","v":53},null,32]
[null,38,{"$f":"$AA$34","v":81},null,38]
[null,39,{"$f":"$AA$35","v":81},null,38]
[null,40,{"$f":"$AA$36","v":81},null,38]
[null,{"$f":"B69","v":0}]
[null,{"$f":"B70","v":0}]
[null,{"$f":"B71","v":0}]
[]
[]
[]
[]
[]
[null,null,null,null,null,null,null,null,null,{"$f":"DCOUNT(J350:J358,1,J347:J348)","v":8}]
[null,null,1,2,3,4,5,null,"Tot","Rank"]
[null,"Team1",{"$f":"$L$8","v":40},{"$f":"$L$9","v":48},{"$f":"$L$10","v":44},{"$f":"$L$11","v":51},{"$f":"$L$12","v":51},{"$f":"$L$14","v":51},{"$f":"$L$13","v":183},4,null,4,null,null,null,null,null,0,0,0,0,0,0,0,0,0]
[null,"Team2",{"$f":"$L$16","v":46},{"$f":"$L$17","v":46},{"$f":"$L$18","v":47},{"$f":"$L$19","v":45},{"$f":"$L$20","v":48},{"$f":"$L$22","v":48},{"$f":"$L$21","v":184},5,null,5,null,null,null,null,null,0,0,0,0,0,0,0,0,0]
[null,"Team3",{"$f":"$L$24","v":42},{"$f":"$L$25","v":48},{"$f":"$L$26","v":54},{"$f":"$L$27","v":45},{"$f":"$L$28","v":44},{"$f":"$L$30","v":54},{"$f":"$L$29","v":179},3,null,3,null,null,null,null,null,0,0,0,0,0,0,0,0,0]
[null,"Team4",{"$f":"$L$32","v":47},{"$f":"$L$33","v":50},{"$f":"$L$34","v":34},{"$f":"$L$35","v":43},{"$f":"$L$36","v":44},{"$f":"$L$38","v":50},{"$f":"$L$37","v":168},1,null,1,null,null,null,null,null,0,0,0,0,0,0,0,0,0]
[null,"Team5",{"$f":"$AA$8","v":46},{"$f":"$AA$9","v":52},{"$f":"$AA$10","v":48},{"$f":"$AA$11","v":48},{"$f":"$AA$12","v":55},{"$f":"$AA$14","v":55},{"$f":"$AA$13","v":194},7,null,7,null,null,null,null,null,0,0,0,0,0,0,0,0,0]
[null,"Team6",{"$f":"$AA$16","v":41},{"$f":"$AA$17","v":40},{"$f":"$AA$18","v":56},{"$f":"$AA$19","v":48},{"$f":"$AA$20","v":55},{"$f":"$AA$22","v":56},{"$f":"$AA$21","v":184},6,null,6,null,null,null,null,null,0,0,0,0,0,0,0,0,0]
[null,"Team7",{"$f":"$AA$24","v":43},{"$f":"$AA$25","v":43},{"$f":"$AA$26","v":45},{"$f":"$AA$27","v":43},{"$f":"$AA$28","v":45},{"$f":"$AA$30","v":45},{"$f":"$AA$29","v":174},2,null,2,null,null,null,null,null,0,0,0,0,0,0,0,0,0]
[null,"Team8",{"$f":"$AA$32","v":56},{"$f":"$AA$33","v":53},{"$f":"$AA$34","v":81},{"$f":"$AA$35","v":81},{"$f":"$AA$36","v":81},{"$f":"$AA$38","v":81},{"$f":"$AA$37","v":271},8,null,8,null,null,null,null,null,0,0,0,0,0,0,0,0,0]
[]
[]
[]
[]
[]
[]
[]
[]
[]
[]
[]
[]
[]
[]
[]
[]
[]
[]
[]
[]
[]
[]
[]
[]
[]
[]
[]
[]
[]
[]
[]
[]
[]
[]
[]
[]
[]
[]
[]
[]
[]
[]
[null,{"$f":"B8","v":"Koby Jones - 12"},{"$f":"L8","v":40}]
[null,{"$f":"B9","v":"Cody Trottier - "},{"$f":"L9","v":48}]
[null,{"$f":"B10","v":"Thomas Bleich - 11"},{"$f":"L10","v":44}]
[null,{"$f":"B11","v":"Ryan Henning - "},{"$f":"L11","v":51}]
[null,{"$f":"B12","v":"Carter Smith - 11"},{"$f":"L12","v":51}]
[null,{"$f":"B16","v":"Ryan Ruona - 11"},{"$f":"L16","v":46}]
[null,{"$f":"B17","v":"Adam Butler - 12"},{"$f":"L17","v":46}]
[null,{"$f":"B18","v":"John Turchi - 10"},{"$f":"L18","v":47}]
[null,{"$f":"B19","v":"Lucas Hass - 11"},{"$f":"L19","v":45}]
[null,{"$f":"B20","v":"Luke Carroll - 10"},{"$f":"L20","v":48}]
[null,{"$f":"B24","v":"George Kneiser - 11"},{"$f":"L24","v":42}]
[null,{"$f":"B25","v":"Colin Prom - 12"},{"$f":"L25","v":48}]
[null,{"$f":"B26","v":"Allan Moutvic - 12"},{"$f":"L26","v":54}]
[null,{"$f":"B27","v":"Brett Lange - 12"},{"$f":"L27","v":45}]
[null,{"$f":"B28","v":"Joey Ploch - "},{"$f":"L28","v":44}]
[null,{"$f":"B32","v":"Jack Burns - 12"},{"$f":"L32","v":47}]
[null,{"$f":"B33","v":"Ryan Graunke - 12"},{"$f":"L33","v":50}]
[null,{"$f":"B34","v":"Austin Walsh - 12"},{"$f":"L34","v":34}]
[null,{"$f":"B35","v":"Chris Evans - 11"},{"$f":"L35","v":43}]
[null,{"$f":"B36","v":"Ryan Kusek - 9"},{"$f":"L36","v":44}]
[null,{"$f":"Q8","v":"Cameron Boyd - 11"},{"$f":"AA8","v":46}]
[null,{"$f":"Q9","v":"Alex Thompson - 9"},{"$f":"AA9","v":52}]
[null,{"$f":"Q10","v":"Collin Travis - 11"},{"$f":"AA10","v":48}]
[null,{"$f":"Q11","v":"Austin Douglas - 10"},{"$f":"AA11","v":48}]
[null,{"$f":"Q12","v":"Trevor  Reierson - 11"},{"$f":"AA12","v":55}]
[null,{"$f":"Q16","v":"Devon Hanson - 11"},{"$f":"AA16","v":41}]
[null,{"$f":"Q17","v":"Mitch Saari - 12"},{"$f":"AA17","v":40}]
[null,{"$f":"Q18","v":"Sam Struebing - 11"},{"$f":"AA18","v":56}]
[null,{"$f":"Q19","v":"Josh Breuer - 12"},{"$f":"AA19","v":48}]
[null,{"$f":"Q20","v":"Brad Halverson - 9"},{"$f":"AA20","v":55}]
[null,{"$f":"Q24","v":"Alex Haas - 12"},{"$f":"AA24","v":43}]
[null,{"$f":"Q25","v":"Max Rohlinger - 10"},{"$f":"AA25","v":43}]
[null,{"$f":"Q26","v":"Kevin Albrecht - 11"},{"$f":"AA26","v":45}]
[null,{"$f":"Q27","v":"Jacob Droese - 12"},{"$f":"AA27","v":43}]
[null,{"$f":"Q28","v":"Nick Meucci - 12"},{"$f":"AA28","v":45}]
[null,{"$f":"Q32","v":"Zachary Stahle - 12"},{"$f":"AA32","v":56}]
[null,{"$f":"Q33","v":"Ben Krause - 12"},{"$f":"AA33","v":53}]
[null,{"$f":"Q34","v":"Scratch #1 - x"},{"$f":"AA34","v":81}]
[null,{"$f":"Q35","v":"Scratch #2 - x"},{"$f":"AA35","v":81}]
[null,{"$f":"Q36","v":"Scratch #3 - x"},{"$f":"AA36","v":81}]

{"sheet":"WT","index":3,"n_rows":440,"n_cols":56,"rows_kept":440,"cut":false,"hidden":false,"merged":[[40,16,40,26],[0,2,0,11],[99,2,99,11],[104,2,104,11],[46,1,48,12]]}
[null,"Course:   ","Watertown Country Club"]
[null,"Hole   ",1,2,3,4,5,6,7,8,9,"Total",null,null,null,null,"Hole   ",{"$f":"C2","v":1},2,3,4,5,6,7,8,9,"Total"]
[null,"  Par   ",5,4,4,4,3,3,4,4,3,{"$f":"SUM(C3:K3)","v":34},null,null,null,null,"  Par   ",5,4,4,4,3,3,4,4,3,{"$f":"L3","v":34}]
[null,"Handicap  ",3,1,5,11,13,17,9,7,15,null,null,null,null,null,"Handicap  ",3,1,5,11,13,17,9,7,15]
[]
[]
["Player","BEAVER DAM",null,null,null,null,null,null,null,null,null,null,"Place",null,null,"Player","WATERTOWN",null,null,null,null,null,null,null,null,null,null,"Place"]
[1,"Koby Jones - 12",5,4,6,3,4,4,4,4,5,{"$f":"IF(COUNTBLANK(C8:K8)>0,\"\",SUM(C8:K8))","v":39},{"$f":"VLOOKUP(BA8,$B$301:$E$340,4)","v":2},null,null,1,"Cameron Boyd - 11",5,5,5,5,5,4,4,6,4,{"$f":"IF(COUNTBLANK(R8:Z8)>0,\"\",SUM(R8:Z8))","v":43},{"$f":"VLOOKUP(BB8,$B$301:$E$340,4)","v":11},null,null,null,null,null,null,null,null,null,null,null,null,null,null,null,null,null,null,null,null,null,null,null,null,1,21,{"$f":"LEN(L8)","v":2},{"$f":"LEN(AA8)","v":2}]
[2,"Thomas Bleich - 11",6,4,7,5,5,4,5,5,3,{"$f":"IF(COUNTBLANK(C9:K9)>0,\"\",SUM(C9:K9))","v":44},{"$f":"VLOOKUP(BA9,$B$301:$E$340,4)","v":16},null,null,2,"Alex Thompson - 9",6,5,5,4,4,4,6,4,4,{"$f":"IF(COUNTBLANK(R9:Z9)>0,\"\",SUM(R9:Z9))","v":42},{"$f":"VLOOKUP(BB9,$B$301:$E$340,4)","v":8},null,null,null,null,null,null,null,null,null,null,null,null,null,null,null,null,null,null,null,null,null,null,null,null,2,22,{"$f":"LEN(L9)","v":2},{"$f":"LEN(AA9)","v":2}]
[3,"Cody Trottier - ",7,5,8,8,4,5,5,6,3,{"$f":"IF(COUNTBLANK(C10:K10)>0,\"\",SUM(C10:K10))","v":51},{"$f":"VLOOKUP(BA10,$B$301:$E$340,4)","v":34},null,null,3,"Collin Travis - 11",7,5,5,6,5,4,5,6,5,{"$f":"IF(COUNTBLANK(R10:Z10)>0,\"\",SUM(R10:Z10))","v":48},{"$f":"VLOOKUP(BB10,$B$301:$E$340,4)","v":32},null,null,null,null,null,null,null,null,null,null,null,null,null,null,null,null,null,null,null,null,null,null,null,null,3,23,{"$f":"LEN(L10)","v":2},{"$f":"LEN(AA10)","v":2}]
[4,"Jacob Smith - 10",6,7,6,6,4,6,4,5,4,{"$f":"IF(COUNTBLANK(C11:K11)>0,\"\",SUM(C11:K11))","v":48},{"$f":"VLOOKUP(BA11,$B$301:$E$340,4)","v":32},null,null,4,"Austin Douglas - 10",9,6,6,5,3,4,5,7,6,{"$f":"IF(COUNTBLANK(R11:Z11)>0,\"\",SUM(R11:Z11))","v":51},{"$f":"VLOOKUP(BB11,$B$301:$E$340,4)","v":34},null,null,null,null,null,null,null,null,null,null,null,null,null,null,null,null,null,null,null,null,null,null,null,null,4,24,{"$f":"LEN(L11)","v":2},{"$f":"LEN(AA11)","v":2}]
[5,"Carter Smith - 11",5,5,8,5,4,4,5,5,4,{"$f":"IF(COUNTBLANK(C12:K12)>0,\"\",SUM(C12:K12))","v":45},{"$f":"VLOOKUP(BA12,$B$301:$E$340,4)","v":20},null,null,5,"Trevor  Reierson - 11",5,6,5,5,4,5,4,5,5,{"$f":"IF(COUNTBLANK(R12:Z12)>0,\"\",SUM(R12:Z12))","v":44},{"$f":"VLOOKUP(BB12,$B$301:$E$340,4)","v":16},null,null,null,null,null,null,null,null,null,null,null,null,null,null,null,null,null,null,null,null,null,null,null,null,5,25,{"$f":"LEN(L12)","v":2},{"$f":"LEN(AA12)","v":2}]
[null,null,null,null,null,null,null,null,null,null,null,{"$f":"IF(COUNT(L8:L12)=5,(SUM(L8:L12))-(MAX(L8:L12)),(IF(COUNT(L8:L12)=4,SUM(L8:L12),IF(COUNTBLANK(L8:L12)>0,SUM(L8:L12),\"DQ\"))))","v":176},{"$f":"J351","v":6},null,null,null,null,null,null,null,null,null,null,null,null,null,{"$f":"IF(COUNT(AA8:AA12)=5,(SUM(AA8:AA12))-(MAX(AA8:AA12)),(IF(COUNT(AA8:AA12)=4,SUM(AA8:AA12),IF(COUNTBLANK(AA8:AA12)>0,SUM(AA8:AA12),\"DQ\"))))","v":177},{"$f":"J355","v":7}]
[null,null,null,null,null,null,null,null,null,null,null,{"$f":"IF(COUNT(L8:L12)=5,MAX(L8:L12),IF(COUNT(L8:L12)<5,200,))","v":51},null,null,null,null,null,null,null,null,null,null,null,null,null,null,{"$f":"IF(COUNT(AA8:AA12)=5,MAX(AA8:AA12),IF(COUNT(AA8:AA12)<5,200,))","v":51}]
["Player","HARTFORD",null,null,null,null,null,null,null,null,null,null,"Place",null,null,"Player","WEST BEND EAST",null,null,null,null,null,null,null,null,null,null,"Place"]
[1,"Ryan Ruona - 11",6,7,5,5,4,5,6,5,3,{"$f":"IF(COUNTBLANK(C16:K16)>0,\"\",SUM(C16:K16))","v":46},{"$f":"VLOOKUP(BA16,$B$301:$E$340,4)","v":28},null,null,1,"Devon Hanson - 11",5,4,4,4,4,4,4,5,3,{"$f":"IF(COUNTBLANK(R16:Z16)>0,\"\",SUM(R16:Z16))","v":37},{"$f":"VLOOKUP(BB16,$B$301:$E$340,4)","v":1},null,null,null,null,null,null,null,null,null,null,null,null,null,null,null,null,null,null,null,null,null,null,null,null,6,26,{"$f":"LEN(L16)","v":2},{"$f":"LEN(AA16)","v":2}]
[2,"Adam Butler - 12",6,7,5,6,4,4,4,4,4,{"$f":"IF(COUNTBLANK(C17:K17)>0,\"\",SUM(C17:K17))","v":44},{"$f":"VLOOKUP(BA17,$B$301:$E$340,4)","v":16},null,null,2,"Mitch Saari - 12",6,8,5,5,4,5,4,5,3,{"$f":"IF(COUNTBLANK(R17:Z17)>0,\"\",SUM(R17:Z17))","v":45},{"$f":"VLOOKUP(BB17,$B$301:$E$340,4)","v":20},null,null,null,null,null,null,null,null,null,null,null,null,null,null,null,null,null,null,null,null,null,null,null,null,7,27,{"$f":"LEN(L17)","v":2},{"$f":"LEN(AA17)","v":2}]
[3,"John Turchi - 10",6,6,6,4,3,5,6,6,3,{"$f":"IF(COUNTBLANK(C18:K18)>0,\"\",SUM(C18:K18))","v":45},{"$f":"VLOOKUP(BA18,$B$301:$E$340,4)","v":20},null,null,3,"Sam Struebing - 11",6,5,7,6,5,4,4,5,4,{"$f":"IF(COUNTBLANK(R18:Z18)>0,\"\",SUM(R18:Z18))","v":46},{"$f":"VLOOKUP(BB18,$B$301:$E$340,4)","v":28},null,null,null,null,null,null,null,null,null,null,null,null,null,null,null,null,null,null,null,null,null,null,null,null,8,28,{"$f":"LEN(L18)","v":2},{"$f":"LEN(AA18)","v":2}]
[4,"Lucas Hass - 11",5,5,5,5,3,6,5,5,3,{"$f":"IF(COUNTBLANK(C19:K19)>0,\"\",SUM(C19:K19))","v":42},{"$f":"VLOOKUP(BA19,$B$301:$E$340,4)","v":8},null,null,4,"Josh Breuer - 12",6,5,6,6,5,5,4,6,4,{"$f":"IF(COUNTBLANK(R19:Z19)>0,\"\",SUM(R19:Z19))","v":47},{"$f":"VLOOKUP(BB19,$B$301:$E$340,4)","v":31},null,null,null,null,null,null,null,null,null,null,null,null,null,null,null,null,null,null,null,null,null,null,null,null,9,29,{"$f":"LEN(L19)","v":2},{"$f":"LEN(AA19)","v":2}]
[5,"Luke Carroll - 10",7,5,6,4,5,4,4,4,4,{"$f":"IF(COUNTBLANK(C20:K20)>0,\"\",SUM(C20:K20))","v":43},{"$f":"VLOOKUP(BA20,$B$301:$E$340,4)","v":11},null,null,5,"Brad Halverson - 9",7,5,10,5,5,5,6,5,3,{"$f":"IF(COUNTBLANK(R20:Z20)>0,\"\",SUM(R20:Z20))","v":51},{"$f":"VLOOKUP(BB20,$B$301:$E$340,4)","v":34},null,null,null,null,null,null,null,null,null,null,null,null,null,null,null,null,null,null,null,null,null,null,null,null,10,30,{"$f":"LEN(L20)","v":2},{"$f":"LEN(AA20)","v":2}]
[null,null,null,null,null,null,null,null,null,null,null,{"$f":"IF(COUNT(L16:L20)=5,(SUM(L16:L20))-(MAX(L16:L20)),(IF(COUNT(L16:L20)=4,SUM(L16:L20),IF(COUNTBLANK(L16:L20)>0,SUM(L16:L20),\"DQ\"))))","v":174},{"$f":"J352","v":4},null,null,null,null,null,null,null,null,null,null,null,null,null,{"$f":"IF(COUNT(AA16:AA20)=5,(SUM(AA16:AA20))-(MAX(AA16:AA20)),(IF(COUNT(AA16:AA20)=4,SUM(AA16:AA20),IF(COUNTBLANK(AA16:AA20)>0,SUM(AA16:AA20),\"DQ\"))))","v":175},{"$f":"J356","v":5}]
[null,null,null,null,null,null,null,null,null,null,null,{"$f":"IF(COUNT(L16:L20)=5,MAX(L16:L20),IF(COUNT(L16:L20)<5,200,))","v":46},null,null,null,null,null,null,null,null,null,null,null,null,null,null,{"$f":"IF(COUNT(AA16:AA20)=5,MAX(AA16:AA20),IF(COUNT(AA16:AA20)<5,200,))","v":51}]
["Player","OCONOMOWOC",null,null,null,null,null,null,null,null,null,null,"Place",null,null,"Player","WEST BEND WEST",null,null,null,null,null,null,null,null,null,null,"Place"]
[1,"George Kneiser - 11",5,6,5,5,4,4,4,4,4,{"$f":"IF(COUNTBLANK(C24:K24)>0,\"\",SUM(C24:K24))","v":41},{"$f":"VLOOKUP(BA24,$B$301:$E$340,4)","v":5},null,null,1,"Alex Haas - 12",6,7,5,5,3,5,5,5,4,{"$f":"IF(COUNTBLANK(R24:Z24)>0,\"\",SUM(R24:Z24))","v":45},{"$f":"VLOOKUP(BB24,$B$301:$E$340,4)","v":20},null,null,null,null,null,null,null,null,null,null,null,null,null,null,null,null,null,null,null,null,null,null,null,null,11,31,{"$f":"LEN(L24)","v":2},{"$f":"LEN(AA24)","v":2}]
[2,"Colin Prom - 12",6,4,5,5,3,5,5,4,4,{"$f":"IF(COUNTBLANK(C25:K25)>0,\"\",SUM(C25:K25))","v":41},{"$f":"VLOOKUP(BA25,$B$301:$E$340,4)","v":5},null,null,2,"Max Rohlinger - 10",6,6,5,4,4,4,4,5,4,{"$f":"IF(COUNTBLANK(R25:Z25)>0,\"\",SUM(R25:Z25))","v":42},{"$f":"VLOOKUP(BB25,$B$301:$E$340,4)","v":8},null,null,null,null,null,null,null,null,null,null,null,null,null,null,null,null,null,null,null,null,null,null,null,null,12,32,{"$f":"LEN(L25)","v":2},{"$f":"LEN(AA25)","v":2}]
[3,"Joey Ploch - ",4,4,4,6,4,5,5,5,4,{"$f":"IF(COUNTBLANK(C26:K26)>0,\"\",SUM(C26:K26))","v":41},{"$f":"VLOOKUP(BA26,$B$301:$E$340,4)","v":5},null,null,3,"Kevin Albrecht - 11",6,4,6,4,6,3,4,4,3,{"$f":"IF(COUNTBLANK(R26:Z26)>0,\"\",SUM(R26:Z26))","v":40},{"$f":"VLOOKUP(BB26,$B$301:$E$340,4)","v":3},null,null,null,null,null,null,null,null,null,null,null,null,null,null,null,null,null,null,null,null,null,null,null,null,13,33,{"$f":"LEN(L26)","v":2},{"$f":"LEN(AA26)","v":2}]
[4,"Allan Moutvic - 12",5,4,5,5,5,3,4,8,6,{"$f":"IF(COUNTBLANK(C27:K27)>0,\"\",SUM(C27:K27))","v":45},{"$f":"VLOOKUP(BA27,$B$301:$E$340,4)","v":20},null,null,4,"Jacob Droese - 12",5,5,6,4,5,3,6,4,7,{"$f":"IF(COUNTBLANK(R27:Z27)>0,\"\",SUM(R27:Z27))","v":45},{"$f":"VLOOKUP(BB27,$B$301:$E$340,4)","v":20},null,null,null,null,null,null,null,null,null,null,null,null,null,null,null,null,null,null,null,null,null,null,null,null,14,34,{"$f":"LEN(L27)","v":2},{"$f":"LEN(AA27)","v":2}]
[5,"Brett Lange - 12",7,6,5,5,4,4,4,5,5,{"$f":"IF(COUNTBLANK(C28:K28)>0,\"\",SUM(C28:K28))","v":45},{"$f":"VLOOKUP(BA28,$B$301:$E$340,4)","v":20},null,null,5,"Nick Meucci - 12",9,4,5,4,3,4,4,3,7,{"$f":"IF(COUNTBLANK(R28:Z28)>0,\"\",SUM(R28:Z28))","v":43},{"$f":"VLOOKUP(BB28,$B$301:$E$340,4)","v":11},null,null,null,null,null,null,null,null,null,null,null,null,null,null,null,null,null,null,null,null,null,null,null,null,15,35,{"$f":"LEN(L28)","v":2},{"$f":"LEN(AA28)","v":2}]
[null,null,null,null,null,null,null,null,null,null,null,{"$f":"IF(COUNT(L24:L28)=5,(SUM(L24:L28))-(MAX(L24:L28)),(IF(COUNT(L24:L28)=4,SUM(L24:L28),IF(COUNTBLANK(L24:L28)>0,SUM(L24:L28),\"DQ\"))))","v":168},{"$f":"J353","v":1},null,null,null,null,null,null,null,null,null,null,null,null,null,{"$f":"IF(COUNT(AA24:AA28)=5,(SUM(AA24:AA28))-(MAX(AA24:AA28)),(IF(COUNT(AA24:AA28)=4,SUM(AA24:AA28),IF(COUNTBLANK(AA24:AA28)>0,SUM(AA24:AA28),\"DQ\"))))","v":170},{"$f":"J357","v":2}]
[null,null,null,null,null,null,null,null,null,null,null,{"$f":"IF(COUNT(L24:L28)=5,MAX(L24:L28),IF(COUNT(L24:L28)<5,200,))","v":45},null,null,null,null,null,null,null,null,null,null,null,null,null,null,{"$f":"IF(COUNT(AA24:AA28)=5,MAX(AA24:AA28),IF(COUNT(AA24:AA28)<5,200,))","v":45}]
["Player","SLINGER",null,null,null,null,null,null,null,null,null,null,"Place",null,null,"Player","WISCONSIN LUTHERAN",null,null,null,null,null,null,null,null,null,null,"Place"]
[1,"Jack Burns - 12",6,5,6,4,3,6,5,4,4,{"$f":"IF(COUNTBLANK(C32:K32)>0,\"\",SUM(C32:K32))","v":43},{"$f":"VLOOKUP(BA32,$B$301:$E$340,4)","v":11},null,null,1,"Scratch #1 - x",9,9,9,9,9,9,9,9,9,{"$f":"IF(COUNTBLANK(R32:Z32)>0,\"\",SUM(R32:Z32))","v":81},{"$f":"VLOOKUP(BB32,$B$301:$E$340,4)","v":38},null,null,null,null,null,null,null,null,null,null,null,null,null,null,null,null,null,null,null,null,null,null,null,null,16,36,{"$f":"LEN(L32)","v":2},{"$f":"LEN(AA32)","v":2}]
[2,"Chris Evans - 11",5,4,5,5,3,5,5,4,4,{"$f":"IF(COUNTBLANK(C33:K33)>0,\"\",SUM(C33:K33))","v":40},{"$f":"VLOOKUP(BA33,$B$301:$E$340,4)","v":3},null,null,2,"Scratch #2 - x",9,9,9,9,9,9,9,9,9,{"$f":"IF(COUNTBLANK(R33:Z33)>0,\"\",SUM(R33:Z33))","v":81},{"$f":"VLOOKUP(BB33,$B$301:$E$340,4)","v":38},null,null,null,null,null,null,null,null,null,null,null,null,null,null,null,null,null,null,null,null,null,null,null,null,17,37,{"$f":"LEN(L33)","v":2},{"$f":"LEN(AA33)","v":2}]
[3,"Austin Walsh - 12",6,4,5,5,5,3,6,7,2,{"$f":"IF(COUNTBLANK(C34:K34)>0,\"\",SUM(C34:K34))","v":43},{"$f":"VLOOKUP(BA34,$B$301:$E$340,4)","v":11},null,null,3,"Scratch #3 - x",9,9,9,9,9,9,9,9,9,{"$f":"IF(COUNTBLANK(R34:Z34)>0,\"\",SUM(R34:Z34))","v":81},{"$f":"VLOOKUP(BB34,$B$301:$E$340,4)","v":38},null,null,null,null,null,null,null,null,null,null,null,null,null,null,null,null,null,null,null,null,null,null,null,null,18,38,{"$f":"LEN(L34)","v":2},{"$f":"LEN(AA34)","v":2}]
[4,"Ryan Erdmann - 10",6,4,5,5,6,5,6,6,3,{"$f":"IF(COUNTBLANK(C35:K35)>0,\"\",SUM(C35:K35))","v":46},{"$f":"VLOOKUP(BA35,$B$301:$E$340,4)","v":28},null,null,4,"Ben Krause - 12",5,5,7,5,5,4,4,5,5,{"$f":"IF(COUNTBLANK(R35:Z35)>0,\"\",SUM(R35:Z35))","v":45},{"$f":"VLOOKUP(BB35,$B$301:$E$340,4)","v":20},null,null,null,null,null,null,null,null,null,null,null,null,null,null,null,null,null,null,null,null,null,null,null,null,19,39,{"$f":"LEN(L35)","v":2},{"$f":"LEN(AA35)","v":2}]
[5,"Ryan Kusek - 9",6,4,6,6,5,3,5,5,4,{"$f":"IF(COUNTBLANK(C36:K36)>0,\"\",SUM(C36:K36))","v":44},{"$f":"VLOOKUP(BA36,$B$301:$E$340,4)","v":16},null,null,5,"Brendan Hausch - 10",5,7,7,7,4,7,7,5,7,{"$f":"IF(COUNTBLANK(R36:Z36)>0,\"\",SUM(R36:Z36))","v":56},{"$f":"VLOOKUP(BB36,$B$301:$E$340,4)","v":37},null,null,null,null,null,null,null,null,null,null,null,null,null,null,null,null,null,null,null,null,null,null,null,null,20,40,{"$f":"LEN(L36)","v":2},{"$f":"LEN(AA36)","v":2}]
[null,null,null,null,null,null,null,null,null,null,null,{"$f":"IF(COUNT(L32:L36)=5,(SUM(L32:L36))-(MAX(L32:L36)),(IF(COUNT(L32:L36)=4,SUM(L32:L36),IF(COUNTBLANK(L32:L36)>0,SUM(L32:L36),\"DQ\"))))","v":170},{"$f":"J354","v":3},null,null,null,null,null,null,null,null,null,null,null,null,null,{"$f":"IF(COUNT(AA32:AA36)=5,(SUM(AA32:AA36))-(MAX(AA32:AA36)),(IF(COUNT(AA32:AA36)=4,SUM(AA32:AA36),IF(COUNTBLANK(AA32:AA36)>0,SUM(AA32:AA36),\"DQ\"))))","v":263},{"$f":"J358","v":8}]
[null,null,null,null,null,null,null,null,null,null,null,{"$f":"IF(COUNT(L32:L36)=5,MAX(L32:L36),IF(COUNT(L32:L36)<5,200,))","v":46},null,null,null,null,null,null,null,null,null,null,null,null,null,null,{"$f":"IF(COUNT(AA32:AA36)=5,MAX(AA32:AA36),IF(COUNT(AA32:AA36)<5,200,))","v":81}]
[]
[]
[null,"Wisconsin Little Ten Varsity Golf",null,null,null,null,"Match # 4",null,null,null,null,"Hosted By: ","Watertown",null,null,null,{"$f":"\"WISCONSIN LITTLE TEN CONFERENCE STANDINGS \" & Schedule!Q41","v":"WISCONSIN LITTLE TEN CONFERENCE STANDINGS "}]
[null,null,null,null,null,null,null,null,null,null,null,null,null,null,null,null,"Match  ","1",2,3,4,5,6,7,8,9,"Total"]
[null,"Date: Apr 30, 2015",null,{"$f":"\"Location: \" & C1","v":"Location: Watertown Country Club"},null,null,null,null,null,null,null,null,null,null,null,null,{"$f":"Rosters!$B$10","v":"West Bend West"},1,1,2,2,null,null,null,null,null,{"$f":"IF(SUM(R43:Z43)=0,\"\",SUM(R43:Z43))","v":6}]
[null,null,null,null,null,null,null,null,null,null,null,null,null,null,null,null,{"$f":"Rosters!$B$6","v":"Oconomowoc"},2,3,3,1,null,null,null,null,null,9]
[null,null,null,null,null,null,null,null,null,null,null,null,null,null,null,null,{"$f":"Rosters!$B$7","v":"Slinger"},4,6,1,3,null,null,null,null,null,14]
[null,null,null,null,null,null,null,null,null,null,null,null,null,null,null,null,{"$f":"Rosters!$B$4","v":"Beaver Dam"},3,2,4,6,null,null,null,null,null,15]
[null,"Medalist: (37) - Devon Hanson",null,null,null,null,null,null,null,null,null,null,null,null,null,null,{"$f":"Rosters!$B$5","v":"Hartford"},6,5,5,4,null,null,null,null,null,20]
[null,null,null,null,null,null,null,null,null,null,null,null,null,null,null,null,{"$f":"Rosters!$B$9","v":"West Bend East"},5,4,6,5,null,null,null,null,null,20]
[null,null,null,null,null,null,null,null,null,null,null,null,null,null,null,null,{"$f":"Rosters!$B$8","v":"Watertown"},7,7,7,7,null,null,null,null,null,28]
[null,null,null,null,null,null,null,null,null,null,null,"= Birdies or Better",null,null,null,null,{"$f":"Rosters!$B$11","v":"Wisconsin Lutheran"},8,8,8,8,null,null,null,null,null,32]
[]
[]
[]
[]
[]
[]
[]
[]
[]
[]
[]
[]
[]
[]
[]
[]
[]
[]
[]
[]
[]
[]
[]
[]
[]
[]
[]
[]
[]
[]
[]
[]
[]
[]
[]
[]
[]
[]
[]
[]
[]
[]
[]
[]
[]
[]
[]
[]
[]
[null,"Course:   ","Watertown Country Club"]
[null,"Hole   ",1,2,3,4,5,6,7,8,9,"Total"]
[null,"  Par   ",5,4,4,4,3,3,4,4,3,{"$f":"SUM(C102:K102)","v":34}]
[null,"Handicap  ",3,1,5,11,13,17,9,7,15]
[]
[null,"Course:   ","Watertown Country Club"]
[null,"Hole   ",10,11,12,13,14,15,16,17,18,"Total"]
[null,"  Par   ",4,3,4,4,5,4,3,5,4,{"$f":"SUM(C107:K107)","v":36}]
[null,"Handicap  ",12,16,14,8,4,6,18,2,10]
[]
[]
[]
[]
[]
[]
[]
[]
[]
[]
[]
[]
[]
[]
[]
[]
[]
[]
[]
[]
[]
[]
[]
[]
[]
[]
[]
[]
[]
[]
[]
[]
[]
[]
[]
[]
[]
[]
[]
[]
[]
[]
[]
[]
[]
[]
[]
[]
[]
[]
[]
[]
[]
[]
[]
[]
[]
[]
[]
[]
[]
[]
[]
[]
[]
[]
[]
[]
[]
[]
[]
[]
[]
[]
[]
[]
[]
[]
[]
[]
[]
[]
[]
[]
[]
[]
[]
[]
[]
[]
[]
[]
[]
[]
[]
[]
[]
[]
[]
[]
[]
[]
[]
[]
[]
[]
[]
[]
[]
[]
[]
[]
[]
[]
[]
[]
[]
[]
[]
[]
[]
[]
[]
[]
[]
[]
[]
[]
[]
[]
[]
[]
[]
[]
[]
[]
[]
[]
[]
[]
[]
[]
[]
[]
[]
[]
[]
[]
[]
[]
[]
[]
[]
[]
[]
[]
[]
[]
[]
[]
[]
[]
[]
[]
[]
[]
[]
[]
[]
[]
[]
[]
[]
[]
[]
[]
[]
[]
[]
[]
[]
[]
[]
[]
[]
[]
[]
[]
[]
[]
[]
[null,"Player","Sc","Sort","Rnk"]
[null,1,{"$f":"$L$8","v":39},null,2]
[null,2,{"$f":"$L$9","v":44},null,16]
[null,3,{"$f":"$L$10","v":51},null,34]
[null,4,{"$f":"$L$11","v":48},null,32]
[null,5,{"$f":"$L$12","v":45},null,20]
[null,6,{"$f":"$L$16","v":46},null,28]
[null,7,{"$f":"$L$17","v":44},null,16]
[null,8,{"$f":"$L$18","v":45},null,20]
[null,9,{"$f":"$L$19","v":42},null,8]
[null,10,{"$f":"$L$20","v":43},null,11]
[null,11,{"$f":"$L$24","v":41},null,5]
[null,12,{"$f":"$L$25","v":41},null,5]
[null,13,{"$f":"$L$26","v":41},null,5]
[null,14,{"$f":"$L$27","v":45},null,20]
[null,15,{"$f":"$L$28","v":45},null,20]
[null,16,{"$f":"$L$32","v":43},null,11]
[null,17,{"$f":"$L$33","v":40},null,3]
[null,18,{"$f":"$L$34","v":43},null,11]
[null,19,{"$f":"$L$35","v":46},null,28]
[null,20,{"$f":"$L$36","v":44},null,16]
[null,21,{"$f":"$AA$8","v":43},null,11]
[null,22,{"$f":"$AA$9","v":42},null,8]
[null,23,{"$f":"$AA$10","v":48},null,32]
[null,24,{"$f":"$AA$11","v":51},null,34]
[null,25,{"$f":"$AA$12","v":44},null,16]
[null,26,{"$f":"$AA$16","v":37},null,1]
[null,27,{"$f":"$AA$17","v":45},null,20]
[null,28,{"$f":"$AA$18","v":46},null,28]
[null,29,{"$f":"$AA$19","v":47},null,31]
[null,30,{"$f":"$AA$20","v":51},null,34]
[null,31,{"$f":"$AA$24","v":45},null,20]
[null,32,{"$f":"$AA$25","v":42},null,8]
[null,33,{"$f":"$AA$26","v":40},null,3]
[null,34,{"$f":"$AA$27","v":45},null,20]
[null,35,{"$f":"$AA$28","v":43},null,11]
[null,36,{"$f":"$AA$32","v":81},null,38]
[null,37,{"$f":"$AA$33","v":81},null,38]
[null,38,{"$f":"$AA$34","v":81},null,38]
[null,39,{"$f":"$AA$35","v":45},null,20]
[null,40,{"$f":"$AA$36","v":56},null,37]
[null,{"$f":"B69","v":0}]
[null,{"$f":"B70","v":0}]
[null,{"$f":"B71","v":0}]
[]
[]
[]
[]
[]
[null,null,null,null,null,null,null,null,null,null,null,null,null,null,null,null,null,"Handicap Holes"]
[null,null,1,2,3,4,5,null,"Tot","Rank",null,null,null,null,null,null,null,{"$f":"IF(SUM($C$4:$K$4)<85,MATCH(1,$C$4:$K$4,0),MATCH(2,$C$4:$K$4,0)+9)","v":2},{"$f":"IF(SUM($C$4:$K$4)<85,MATCH(3,$C$4:$K$4,0),MATCH(4,$C$4:$K$4,0)+9)","v":1},{"$f":"IF(SUM($C$4:$K$4)<85,MATCH(5,$C$4:$K$4,0),MATCH(6,$C$4:$K$4,0)+9)","v":3},{"$f":"IF(SUM($C$4:$K$4)<85,MATCH(7,$C$4:$K$4,0),MATCH(8,$C$4:$K$4,0)+9)","v":8},{"$f":"IF(SUM($C$4:$K$4)<85,MATCH(9,$C$4:$K$4,0),MATCH(10,$C$4:$K$4,0)+9)","v":7},{"$f":"IF(SUM($C$4:$K$4)<85,MATCH(11,$C$4:$K$4,0),MATCH(12,$C$4:$K$4,0)+9)","v":4},{"$f":"IF(SUM($C$4:$K$4)<85,MATCH(13,$C$4:$K$4,0),MATCH(14,$C$4:$K$4,0)+9)","v":5},{"$f":"IF(SUM($C$4:$K$4)<85,MATCH(15,$C$4:$K$4,0),MATCH(16,$C$4:$K$4,0)+9)","v":9},{"$f":"IF(SUM($C$4:$K$4)<85,MATCH(17,$C$4:$K$4,0),MATCH(18,$C$4:$K$4,0)+9)","v":6}]
[null,"Team1",{"$f":"$L$8","v":39},{"$f":"$L$9","v":44},{"$f":"$L$10","v":51},{"$f":"$L$11","v":48},{"$f":"$L$12","v":45},{"$f":"$L$14","v":51},{"$f":"$L$13","v":176},6,null,6,null,null,null,null,null,25,29,35,25,23,27,21,19,23]
[null,"Team2",{"$f":"$L$16","v":46},{"$f":"$L$17","v":44},{"$f":"$L$18","v":45},{"$f":"$L$19","v":42},{"$f":"$L$20","v":43},{"$f":"$L$22","v":46},{"$f":"$L$21","v":174},4,null,4,null,null,null,null,null,30,30,27,24,25,24,19,17,24]
[null,"Team3",{"$f":"$L$24","v":41},{"$f":"$L$25","v":41},{"$f":"$L$26","v":41},{"$f":"$L$27","v":45},{"$f":"$L$28","v":45},{"$f":"$L$30","v":45},{"$f":"$L$29","v":168},1,null,1,null,null,null,null,null,24,27,24,26,22,26,20,23,21]
[null,"Team4",{"$f":"$L$32","v":43},{"$f":"$L$33","v":40},{"$f":"$L$34","v":43},{"$f":"$L$35","v":46},{"$f":"$L$36","v":44},{"$f":"$L$38","v":46},{"$f":"$L$37","v":170},3,null,3,null,null,null,null,null,21,29,27,26,27,25,22,17,22]
[null,"Team5",{"$f":"$AA$8","v":43},{"$f":"$AA$9","v":42},{"$f":"$AA$10","v":48},{"$f":"$AA$11","v":51},{"$f":"$AA$12","v":44},{"$f":"$AA$14","v":51},{"$f":"$AA$13","v":177},7,null,7,null,null,null,null,null,27,32,26,28,24,25,21,24,21]
[null,"Team6",{"$f":"$AA$16","v":37},{"$f":"$AA$17","v":45},{"$f":"$AA$18","v":46},{"$f":"$AA$19","v":47},{"$f":"$AA$20","v":51},{"$f":"$AA$22","v":51},{"$f":"$AA$21","v":175},5,null,5,null,null,null,null,null,27,30,32,26,22,26,23,17,23]
[null,"Team7",{"$f":"$AA$24","v":45},{"$f":"$AA$25","v":42},{"$f":"$AA$26","v":40},{"$f":"$AA$27","v":45},{"$f":"$AA$28","v":43},{"$f":"$AA$30","v":45},{"$f":"$AA$29","v":170},2,null,2,null,null,null,null,null,26,32,27,21,23,21,21,25,19]
[null,"Team8",{"$f":"$AA$32","v":81},{"$f":"$AA$33","v":81},{"$f":"$AA$34","v":81},{"$f":"$AA$35","v":45},{"$f":"$AA$36","v":56},{"$f":"$AA$38","v":81},{"$f":"$AA$37","v":263},8,null,8,null,null,null,null,null,39,37,41,37,38,39,36,39,38]
[]
[]
[]
[]
[]
[]
[]
[]
[]
[]
[]
[]
[]
[]
[]
[]
[]
[]
[]
[]
[]
[]
[]
[]
[]
[]
[]
[]
[]
[]
[]
[]
[]
[]
[]
[]
[]
[]
[]
[]
[]
[]
[null,{"$f":"B8","v":"Koby Jones - 12"},{"$f":"L8","v":39}]
[null,{"$f":"B9","v":"Thomas Bleich - 11"},{"$f":"L9","v":44}]
[null,{"$f":"B10","v":"Cody Trottier - "},{"$f":"L10","v":51}]
[null,{"$f":"B11","v":"Jacob Smith - 10"},{"$f":"L11","v":48}]
[null,{"$f":"B12","v":"Carter Smith - 11"},{"$f":"L12","v":45}]
[null,{"$f":"B16","v":"Ryan Ruona - 11"},{"$f":"L16","v":46}]
[null,{"$f":"B17","v":"Adam Butler - 12"},{"$f":"L17","v":44}]
[null,{"$f":"B18","v":"John Turchi - 10"},{"$f":"L18","v":45}]
[null,{"$f":"B19","v":"Lucas Hass - 11"},{"$f":"L19","v":42}]
[null,{"$f":"B20","v":"Luke Carroll - 10"},{"$f":"L20","v":43}]
[null,{"$f":"B24","v":"George Kneiser - 11"},{"$f":"L24","v":41}]
[null,{"$f":"B25","v":"Colin Prom - 12"},{"$f":"L25","v":41}]
[null,{"$f":"B26","v":"Joey Ploch - "},{"$f":"L26","v":41}]
[null,{"$f":"B27","v":"Allan Moutvic - 12"},{"$f":"L27","v":45}]
[null,{"$f":"B28","v":"Brett Lange - 12"},{"$f":"L28","v":45}]
[null,{"$f":"B32","v":"Jack Burns - 12"},{"$f":"L32","v":43}]
[null,{"$f":"B33","v":"Chris Evans - 11"},{"$f":"L33","v":40}]
[null,{"$f":"B34","v":"Austin Walsh - 12"},{"$f":"L34","v":43}]
[null,{"$f":"B35","v":"Ryan Erdmann - 10"},{"$f":"L35","v":46}]
[null,{"$f":"B36","v":"Ryan Kusek - 9"},{"$f":"L36","v":44}]
[null,{"$f":"Q8","v":"Cameron Boyd - 11"},{"$f":"AA8","v":43}]
[null,{"$f":"Q9","v":"Alex Thompson - 9"},{"$f":"AA9","v":42}]
[null,{"$f":"Q10","v":"Collin Travis - 11"},{"$f":"AA10","v":48}]
[null,{"$f":"Q11","v":"Austin Douglas - 10"},{"$f":"AA11","v":51}]
[null,{"$f":"Q12","v":"Trevor  Reierson - 11"},{"$f":"AA12","v":44}]
[null,{"$f":"Q16","v":"Devon Hanson - 11"},{"$f":"AA16","v":37}]
[null,{"$f":"Q17","v":"Mitch Saari - 12"},{"$f":"AA17","v":45}]
[null,{"$f":"Q18","v":"Sam Struebing - 11"},{"$f":"AA18","v":46}]
[null,{"$f":"Q19","v":"Josh Breuer - 12"},{"$f":"AA19","v":47}]
[null,{"$f":"Q20","v":"Brad Halverson - 9"},{"$f":"AA20","v":51}]
[null,{"$f":"Q24","v":"Alex Haas - 12"},{"$f":"AA24","v":45}]
[null,{"$f":"Q25","v":"Max Rohlinger - 10"},{"$f":"AA25","v":42}]
[null,{"$f":"Q26","v":"Kevin Albrecht - 11"},{"$f":"AA26","v":40}]
[null,{"$f":"Q27","v":"Jacob Droese - 12"},{"$f":"AA27","v":45}]
[null,{"$f":"Q28","v":"Nick Meucci - 12"},{"$f":"AA28","v":43}]
[null,{"$f":"Q32","v":"Scratch #1 - x"},{"$f":"AA32","v":81}]
[null,{"$f":"Q33","v":"Scratch #2 - x"},{"$f":"AA33","v":81}]
[null,{"$f":"Q34","v":"Scratch #3 - x"},{"$f":"AA34","v":81}]
[null,{"$f":"Q35","v":"Ben Krause - 12"},{"$f":"AA35","v":45}]
[null,{"$f":"Q36","v":"Brendan Hausch - 10"},{"$f":"AA36","v":56}]

{"sheet":"OC","index":4,"n_rows":440,"n_cols":56,"rows_kept":440,"cut":false,"hidden":false,"merged":[[130,2,130,11],[114,2,114,11],[119,2,119,11],[0,2,0,11],[40,16,40,26],[99,2,99,11],[104,2,104,11],[46,1,48,12],[125,2,125,11]]}
[null,"Course:   ","Oconomowoc Golf Club"]
[null,"Hole   ",1,2,3,4,5,6,7,8,9,"Total",null,null,null,null,"Hole   ",{"$f":"C2","v":1},2,3,4,5,6,7,8,9,"Total"]
[null,"  Par   ",4,4,4,3,4,3,4,5,4,{"$f":"SUM(C3:K3)","v":35},null,null,null,null,"  Par   ",4,4,4,3,4,3,4,5,4,{"$f":"L3","v":35}]
[null,"Handicap  ",13,3,7,15,5,17,9,1,11,null,null,null,null,null,"Handicap  ",13,3,7,15,5,17,9,1,11]
[]
[]
["Player","BEAVER DAM",null,null,null,null,null,null,null,null,null,null,"Place",null,null,"Player","WATERTOWN",null,null,null,null,null,null,null,null,null,null,"Place"]
[1,"Koby Jones - 12",6,5,5,5,4,3,4,6,5,{"$f":"IF(COUNTBLANK(C8:K8)>0,\"\",SUM(C8:K8))","v":43},{"$f":"VLOOKUP(BA8,$B$301:$E$340,4)","v":11},null,null,1,"Cameron Boyd - 11",5,6,4,4,4,4,4,11,5,{"$f":"IF(COUNTBLANK(R8:Z8)>0,\"\",SUM(R8:Z8))","v":47},{"$f":"VLOOKUP(BB8,$B$301:$E$340,4)","v":23},null,null,null,null,null,null,null,null,null,null,null,null,null,null,null,null,null,null,null,null,null,null,null,null,1,21,{"$f":"LEN(L8)","v":2},{"$f":"LEN(AA8)","v":2}]
[2,"Thomas Bleich - 11",5,5,5,4,4,4,5,6,5,{"$f":"IF(COUNTBLANK(C9:K9)>0,\"\",SUM(C9:K9))","v":43},{"$f":"VLOOKUP(BA9,$B$301:$E$340,4)","v":11},null,null,2,"Alex Thompson - 9",5,5,7,5,5,4,5,7,5,{"$f":"IF(COUNTBLANK(R9:Z9)>0,\"\",SUM(R9:Z9))","v":48},{"$f":"VLOOKUP(BB9,$B$301:$E$340,4)","v":25},null,null,null,null,null,null,null,null,null,null,null,null,null,null,null,null,null,null,null,null,null,null,null,null,2,22,{"$f":"LEN(L9)","v":2},{"$f":"LEN(AA9)","v":2}]
[3,"Cody Trottier - 12",5,4,7,3,5,3,5,6,4,{"$f":"IF(COUNTBLANK(C10:K10)>0,\"\",SUM(C10:K10))","v":42},{"$f":"VLOOKUP(BA10,$B$301:$E$340,4)","v":7},null,null,3,"Collin Travis - 11",4,7,6,4,4,5,6,6,7,{"$f":"IF(COUNTBLANK(R10:Z10)>0,\"\",SUM(R10:Z10))","v":49},{"$f":"VLOOKUP(BB10,$B$301:$E$340,4)","v":30},null,null,null,null,null,null,null,null,null,null,null,null,null,null,null,null,null,null,null,null,null,null,null,null,3,23,{"$f":"LEN(L10)","v":2},{"$f":"LEN(AA10)","v":2}]
[4,"Jacob Smith - 10",4,4,4,4,5,4,6,6,5,{"$f":"IF(COUNTBLANK(C11:K11)>0,\"\",SUM(C11:K11))","v":42},{"$f":"VLOOKUP(BA11,$B$301:$E$340,4)","v":7},null,null,4,"Austin Douglas - 10",5,6,7,6,6,5,7,5,8,{"$f":"IF(COUNTBLANK(R11:Z11)>0,\"\",SUM(R11:Z11))","v":55},{"$f":"VLOOKUP(BB11,$B$301:$E$340,4)","v":35},null,null,null,null,null,null,null,null,null,null,null,null,null,null,null,null,null,null,null,null,null,null,null,null,4,24,{"$f":"LEN(L11)","v":2},{"$f":"LEN(AA11)","v":2}]
[5,"Carter Smith - 11",4,5,5,4,4,3,5,6,6,{"$f":"IF(COUNTBLANK(C12:K12)>0,\"\",SUM(C12:K12))","v":42},{"$f":"VLOOKUP(BA12,$B$301:$E$340,4)","v":7},null,null,5,"Trevor  Reierson - 11",4,4,7,5,4,5,4,8,7,{"$f":"IF(COUNTBLANK(R12:Z12)>0,\"\",SUM(R12:Z12))","v":48},{"$f":"VLOOKUP(BB12,$B$301:$E$340,4)","v":25},null,null,null,null,null,null,null,null,null,null,null,null,null,null,null,null,null,null,null,null,null,null,null,null,5,25,{"$f":"LEN(L12)","v":2},{"$f":"LEN(AA12)","v":2}]
[null,null,null,null,null,null,null,null,null,null,null,{"$f":"IF(COUNT(L8:L12)=5,(SUM(L8:L12))-(MAX(L8:L12)),(IF(COUNT(L8:L12)=4,SUM(L8:L12),IF(COUNTBLANK(L8:L12)>0,SUM(L8:L12),\"DQ\"))))","v":169},{"$f":"J351","v":1},null,null,null,null,null,null,null,null,null,null,null,null,null,{"$f":"IF(COUNT(AA8:AA12)=5,(SUM(AA8:AA12))-(MAX(AA8:AA12)),(IF(COUNT(AA8:AA12)=4,SUM(AA8:AA12),IF(COUNTBLANK(AA8:AA12)>0,SUM(AA8:AA12),\"DQ\"))))","v":192},{"$f":"J355","v":7}]
[null,null,null,null,null,null,null,null,null,null,null,{"$f":"IF(COUNT(L8:L12)=5,MAX(L8:L12),IF(COUNT(L8:L12)<5,200,))","v":43},null,null,null,null,null,null,null,null,null,null,null,null,null,null,{"$f":"IF(COUNT(AA8:AA12)=5,MAX(AA8:AA12),IF(COUNT(AA8:AA12)<5,200,))","v":55}]
["Player","HARTFORD",null,null,null,null,null,null,null,null,null,null,"Place",null,null,"Player","WEST BEND EAST",null,null,null,null,null,null,null,null,null,null,"Place"]
[1,"Ryan Ruona - 11",5,4,6,4,5,4,4,6,4,{"$f":"IF(COUNTBLANK(C16:K16)>0,\"\",SUM(C16:K16))","v":42},{"$f":"VLOOKUP(BA16,$B$301:$E$340,4)","v":7},null,null,1,"Devon Hanson - 11",4,4,4,4,5,5,4,5,5,{"$f":"IF(COUNTBLANK(R16:Z16)>0,\"\",SUM(R16:Z16))","v":40},{"$f":"VLOOKUP(BB16,$B$301:$E$340,4)","v":3},null,null,null,null,null,null,null,null,null,null,null,null,null,null,null,null,null,null,null,null,null,null,null,null,6,26,{"$f":"LEN(L16)","v":2},{"$f":"LEN(AA16)","v":2}]
[2,"Adam Butler - 12",5,4,5,5,6,4,6,6,7,{"$f":"IF(COUNTBLANK(C17:K17)>0,\"\",SUM(C17:K17))","v":48},{"$f":"VLOOKUP(BA17,$B$301:$E$340,4)","v":25},null,null,2,"Mitch Saari - 12",5,5,5,3,5,2,6,5,5,{"$f":"IF(COUNTBLANK(R17:Z17)>0,\"\",SUM(R17:Z17))","v":41},{"$f":"VLOOKUP(BB17,$B$301:$E$340,4)","v":6},null,null,null,null,null,null,null,null,null,null,null,null,null,null,null,null,null,null,null,null,null,null,null,null,7,27,{"$f":"LEN(L17)","v":2},{"$f":"LEN(AA17)","v":2}]
[3,"John Turchi - 10",5,4,6,4,6,6,6,6,6,{"$f":"IF(COUNTBLANK(C18:K18)>0,\"\",SUM(C18:K18))","v":49},{"$f":"VLOOKUP(BA18,$B$301:$E$340,4)","v":30},null,null,3,"Josh Breuer - 12",6,4,4,5,7,5,7,6,7,{"$f":"IF(COUNTBLANK(R18:Z18)>0,\"\",SUM(R18:Z18))","v":51},{"$f":"VLOOKUP(BB18,$B$301:$E$340,4)","v":33},null,null,null,null,null,null,null,null,null,null,null,null,null,null,null,null,null,null,null,null,null,null,null,null,8,28,{"$f":"LEN(L18)","v":2},{"$f":"LEN(AA18)","v":2}]
[4,"Lucas Hass - 11",4,4,5,4,6,6,6,5,6,{"$f":"IF(COUNTBLANK(C19:K19)>0,\"\",SUM(C19:K19))","v":46},{"$f":"VLOOKUP(BA19,$B$301:$E$340,4)","v":20},null,null,4,"Sam Struebing - 11",5,6,6,4,4,5,7,5,6,{"$f":"IF(COUNTBLANK(R19:Z19)>0,\"\",SUM(R19:Z19))","v":48},{"$f":"VLOOKUP(BB19,$B$301:$E$340,4)","v":25},null,null,null,null,null,null,null,null,null,null,null,null,null,null,null,null,null,null,null,null,null,null,null,null,9,29,{"$f":"LEN(L19)","v":2},{"$f":"LEN(AA19)","v":2}]
[5,"Luke Carroll - 10",4,5,7,3,5,4,4,7,8,{"$f":"IF(COUNTBLANK(C20:K20)>0,\"\",SUM(C20:K20))","v":47},{"$f":"VLOOKUP(BA20,$B$301:$E$340,4)","v":23},null,null,5,"Brad Halverson - 9",4,5,6,4,5,6,6,5,5,{"$f":"IF(COUNTBLANK(R20:Z20)>0,\"\",SUM(R20:Z20))","v":46},{"$f":"VLOOKUP(BB20,$B$301:$E$340,4)","v":20},null,null,null,null,null,null,null,null,null,null,null,null,null,null,null,null,null,null,null,null,null,null,null,null,10,30,{"$f":"LEN(L20)","v":2},{"$f":"LEN(AA20)","v":2}]
[null,null,null,null,null,null,null,null,null,null,null,{"$f":"IF(COUNT(L16:L20)=5,(SUM(L16:L20))-(MAX(L16:L20)),(IF(COUNT(L16:L20)=4,SUM(L16:L20),IF(COUNTBLANK(L16:L20)>0,SUM(L16:L20),\"DQ\"))))","v":183},{"$f":"J352","v":6},null,null,null,null,null,null,null,null,null,null,null,null,null,{"$f":"IF(COUNT(AA16:AA20)=5,(SUM(AA16:AA20))-(MAX(AA16:AA20)),(IF(COUNT(AA16:AA20)=4,SUM(AA16:AA20),IF(COUNTBLANK(AA16:AA20)>0,SUM(AA16:AA20),\"DQ\"))))","v":175},{"$f":"J356","v":4}]
[null,null,null,null,null,null,null,null,null,null,null,{"$f":"IF(COUNT(L16:L20)=5,MAX(L16:L20),IF(COUNT(L16:L20)<5,200,))","v":49},null,null,null,null,null,null,null,null,null,null,null,null,null,null,{"$f":"IF(COUNT(AA16:AA20)=5,MAX(AA16:AA20),IF(COUNT(AA16:AA20)<5,200,))","v":51}]
["Player","OCONOMOWOC",null,null,null,null,null,null,null,null,null,null,"Place",null,null,"Player","WEST BEND WEST",null,null,null,null,null,null,null,null,null,null,"Place"]
[1,"George Kneiser - 11",5,7,6,4,4,3,4,6,5,{"$f":"IF(COUNTBLANK(C24:K24)>0,\"\",SUM(C24:K24))","v":44},{"$f":"VLOOKUP(BA24,$B$301:$E$340,4)","v":14},null,null,1,"Alex Haas - 12",6,5,4,5,5,4,7,5,5,{"$f":"IF(COUNTBLANK(R24:Z24)>0,\"\",SUM(R24:Z24))","v":46},{"$f":"VLOOKUP(BB24,$B$301:$E$340,4)","v":20},null,null,null,null,null,null,null,null,null,null,null,null,null,null,null,null,null,null,null,null,null,null,null,null,11,31,{"$f":"LEN(L24)","v":2},{"$f":"LEN(AA24)","v":2}]
[2,"Colin Prom - 12",4,6,4,3,4,4,5,6,3,{"$f":"IF(COUNTBLANK(C25:K25)>0,\"\",SUM(C25:K25))","v":39},{"$f":"VLOOKUP(BA25,$B$301:$E$340,4)","v":2},null,null,2,"Max Rohlinger - 10",4,5,4,4,5,3,4,7,4,{"$f":"IF(COUNTBLANK(R25:Z25)>0,\"\",SUM(R25:Z25))","v":40},{"$f":"VLOOKUP(BB25,$B$301:$E$340,4)","v":3},null,null,null,null,null,null,null,null,null,null,null,null,null,null,null,null,null,null,null,null,null,null,null,null,12,32,{"$f":"LEN(L25)","v":2},{"$f":"LEN(AA25)","v":2}]
[3,"Joey Ploch - 9",5,4,5,4,5,4,6,6,5,{"$f":"IF(COUNTBLANK(C26:K26)>0,\"\",SUM(C26:K26))","v":44},{"$f":"VLOOKUP(BA26,$B$301:$E$340,4)","v":14},null,null,3,"Kevin Albrecht - 11",4,5,6,6,7,3,5,8,5,{"$f":"IF(COUNTBLANK(R26:Z26)>0,\"\",SUM(R26:Z26))","v":49},{"$f":"VLOOKUP(BB26,$B$301:$E$340,4)","v":30},null,null,null,null,null,null,null,null,null,null,null,null,null,null,null,null,null,null,null,null,null,null,null,null,13,33,{"$f":"LEN(L26)","v":2},{"$f":"LEN(AA26)","v":2}]
[4,"Brett Lange - 12",9,9,9,9,9,9,9,9,9,{"$f":"IF(COUNTBLANK(C27:K27)>0,\"\",SUM(C27:K27))","v":81},{"$f":"VLOOKUP(BA27,$B$301:$E$340,4)","v":37},"DQ",null,4,"Jacob Droese - 12",5,6,5,5,7,6,6,7,6,{"$f":"IF(COUNTBLANK(R27:Z27)>0,\"\",SUM(R27:Z27))","v":53},{"$f":"VLOOKUP(BB27,$B$301:$E$340,4)","v":34},null,null,null,null,null,null,null,null,null,null,null,null,null,null,null,null,null,null,null,null,null,null,null,null,14,34,{"$f":"LEN(L27)","v":2},{"$f":"LEN(AA27)","v":2}]
[5,"Allan Moutvic - 12",5,4,4,4,5,4,6,6,6,{"$f":"IF(COUNTBLANK(C28:K28)>0,\"\",SUM(C28:K28))","v":44},{"$f":"VLOOKUP(BA28,$B$301:$E$340,4)","v":14},null,null,5,"Nick Meucci - 12",4,4,4,3,5,4,5,6,5,{"$f":"IF(COUNTBLANK(R28:Z28)>0,\"\",SUM(R28:Z28))","v":40},{"$f":"VLOOKUP(BB28,$B$301:$E$340,4)","v":3},null,null,null,null,null,null,null,null,null,null,null,null,null,null,null,null,null,null,null,null,null,null,null,null,15,35,{"$f":"LEN(L28)","v":2},{"$f":"LEN(AA28)","v":2}]
[null,null,null,null,null,null,null,null,null,null,null,{"$f":"IF(COUNT(L24:L28)=5,(SUM(L24:L28))-(MAX(L24:L28)),(IF(COUNT(L24:L28)=4,SUM(L24:L28),IF(COUNTBLANK(L24:L28)>0,SUM(L24:L28),\"DQ\"))))","v":171},{"$f":"J353","v":3},null,null,null,null,null,null,null,null,null,null,null,null,null,{"$f":"IF(COUNT(AA24:AA28)=5,(SUM(AA24:AA28))-(MAX(AA24:AA28)),(IF(COUNT(AA24:AA28)=4,SUM(AA24:AA28),IF(COUNTBLANK(AA24:AA28)>0,SUM(AA24:AA28),\"DQ\"))))","v":175},{"$f":"J357","v":5}]
[null,null,null,null,null,null,null,null,null,null,null,{"$f":"IF(COUNT(L24:L28)=5,MAX(L24:L28),IF(COUNT(L24:L28)<5,200,))","v":81},null,null,null,null,null,null,null,null,null,null,null,null,null,null,{"$f":"IF(COUNT(AA24:AA28)=5,MAX(AA24:AA28),IF(COUNT(AA24:AA28)<5,200,))","v":53}]
["Player","SLINGER",null,null,null,null,null,null,null,null,null,null,"Place",null,null,"Player","WISCONSIN LUTHERAN",null,null,null,null,null,null,null,null,null,null,"Place"]
[1,"Jack Burns - 12",4,4,5,4,3,3,5,6,4,{"$f":"IF(COUNTBLANK(C32:K32)>0,\"\",SUM(C32:K32))","v":38},{"$f":"VLOOKUP(BA32,$B$301:$E$340,4)","v":1},null,null,1,"Scratch #1 - x",9,9,9,9,9,9,9,9,9,{"$f":"IF(COUNTBLANK(R32:Z32)>0,\"\",SUM(R32:Z32))","v":81},{"$f":"VLOOKUP(BB32,$B$301:$E$340,4)","v":37},null,null,null,null,null,null,null,null,null,null,null,null,null,null,null,null,null,null,null,null,null,null,null,null,16,36,{"$f":"LEN(L32)","v":2},{"$f":"LEN(AA32)","v":2}]
[2,"Chris Evans - 11",5,5,5,3,6,5,5,6,5,{"$f":"IF(COUNTBLANK(C33:K33)>0,\"\",SUM(C33:K33))","v":45},{"$f":"VLOOKUP(BA33,$B$301:$E$340,4)","v":17},null,null,2,"Scratch #2 - x",9,9,9,9,9,9,9,9,9,{"$f":"IF(COUNTBLANK(R33:Z33)>0,\"\",SUM(R33:Z33))","v":81},{"$f":"VLOOKUP(BB33,$B$301:$E$340,4)","v":37},null,null,null,null,null,null,null,null,null,null,null,null,null,null,null,null,null,null,null,null,null,null,null,null,17,37,{"$f":"LEN(L33)","v":2},{"$f":"LEN(AA33)","v":2}]
[3,"Austin Walsh - 12",5,5,5,3,5,4,5,7,4,{"$f":"IF(COUNTBLANK(C34:K34)>0,\"\",SUM(C34:K34))","v":43},{"$f":"VLOOKUP(BA34,$B$301:$E$340,4)","v":11},null,null,3,"Ben Krause - 12",5,5,5,5,5,3,5,7,5,{"$f":"IF(COUNTBLANK(R34:Z34)>0,\"\",SUM(R34:Z34))","v":45},{"$f":"VLOOKUP(BB34,$B$301:$E$340,4)","v":17},null,null,null,null,null,null,null,null,null,null,null,null,null,null,null,null,null,null,null,null,null,null,null,null,18,38,{"$f":"LEN(L34)","v":2},{"$f":"LEN(AA34)","v":2}]
[4,"Ryan Erdmann - 10",5,6,5,5,5,3,6,7,6,{"$f":"IF(COUNTBLANK(C35:K35)>0,\"\",SUM(C35:K35))","v":48},{"$f":"VLOOKUP(BA35,$B$301:$E$340,4)","v":25},null,null,4,"Brendan Hausch - 10",7,6,7,7,6,5,6,8,7,{"$f":"IF(COUNTBLANK(R35:Z35)>0,\"\",SUM(R35:Z35))","v":59},{"$f":"VLOOKUP(BB35,$B$301:$E$340,4)","v":36},null,null,null,null,null,null,null,null,null,null,null,null,null,null,null,null,null,null,null,null,null,null,null,null,19,39,{"$f":"LEN(L35)","v":2},{"$f":"LEN(AA35)","v":2}]
[5,"Ryan Kusek - 9",5,5,5,3,5,5,5,6,6,{"$f":"IF(COUNTBLANK(C36:K36)>0,\"\",SUM(C36:K36))","v":45},{"$f":"VLOOKUP(BA36,$B$301:$E$340,4)","v":17},null,null,5,"Scratch #3 - x",9,9,9,9,9,9,9,9,9,{"$f":"IF(COUNTBLANK(R36:Z36)>0,\"\",SUM(R36:Z36))","v":81},{"$f":"VLOOKUP(BB36,$B$301:$E$340,4)","v":37},null,null,null,null,null,null,null,null,null,null,null,null,null,null,null,null,null,null,null,null,null,null,null,null,20,40,{"$f":"LEN(L36)","v":2},{"$f":"LEN(AA36)","v":2}]
[null,null,null,null,null,null,null,null,null,null,null,{"$f":"IF(COUNT(L32:L36)=5,(SUM(L32:L36))-(MAX(L32:L36)),(IF(COUNT(L32:L36)=4,SUM(L32:L36),IF(COUNTBLANK(L32:L36)>0,SUM(L32:L36),\"DQ\"))))","v":171},{"$f":"J354","v":2},null,null,null,null,null,null,null,null,null,null,null,null,null,{"$f":"IF(COUNT(AA32:AA36)=5,(SUM(AA32:AA36))-(MAX(AA32:AA36)),(IF(COUNT(AA32:AA36)=4,SUM(AA32:AA36),IF(COUNTBLANK(AA32:AA36)>0,SUM(AA32:AA36),\"DQ\"))))","v":266},{"$f":"J358","v":8}]
[null,null,null,null,null,null,null,null,null,null,null,{"$f":"IF(COUNT(L32:L36)=5,MAX(L32:L36),IF(COUNT(L32:L36)<5,200,))","v":48},null,null,null,null,null,null,null,null,null,null,null,null,null,null,{"$f":"IF(COUNT(AA32:AA36)=5,MAX(AA32:AA36),IF(COUNT(AA32:AA36)<5,200,))","v":81}]
[]
[]
[null,"Wisconsin Little Ten Varsity Golf",null,null,null,null,"Match # 5",null,null,null,null,"Hosted By: ","Oconomowoc",null,null,null,{"$f":"\"WISCONSIN LITTLE TEN CONFERENCE STANDINGS \" & Schedule!Q41","v":"WISCONSIN LITTLE TEN CONFERENCE STANDINGS "}]
[null,null,null,null,null,null,null,null,null,null,null,null,null,null,null,null,"Match  ","1",2,3,4,5,6,7,8,9,"Total"]
[null,"Date: May 4, 2015",null,{"$f":"\"Location: \" & C1","v":"Location: Oconomowoc Golf Club"},null,null,null,null,null,null,null,null,null,null,null,null,{"$f":"Rosters!$B$10","v":"West Bend West"},1,1,2,2,5,null,null,null,null,{"$f":"IF(SUM(R43:Z43)=0,\"\",SUM(R43:Z43))","v":11}]
[null,"Weather: 65, partly sunny, light wind…quite nice, actually! ",null,null,null,null,null,null,null,null,null,null,null,null,null,null,{"$f":"Rosters!$B$6","v":"Oconomowoc"},2,3,3,1,3,null,null,null,null,12]
[null,null,null,null,null,null,null,null,null,null,null,null,null,null,null,null,{"$f":"Rosters!$B$4","v":"Beaver Dam"},3,2,4,6,1,null,null,null,null,16]
[null,null,null,null,null,null,null,null,null,null,null,null,null,null,null,null,{"$f":"Rosters!$B$7","v":"Slinger"},4,6,1,3,2,null,null,null,null,16]
[null,"Medalist: (38) - Jack Burns",null,null,null,null,null,null,null,null,null,null,null,null,null,null,{"$f":"Rosters!$B$9","v":"West Bend East"},5,4,6,5,4,null,null,null,null,24]
[null,null,null,null,null,null,null,null,null,null,null,null,null,null,null,null,{"$f":"Rosters!$B$5","v":"Hartford"},6,5,5,4,6,null,null,null,null,26]
[null,null,null,null,null,null,null,null,null,null,null,null,null,null,null,null,{"$f":"Rosters!$B$8","v":"Watertown"},7,7,7,7,7,null,null,null,null,35]
[null,null,null,null,null,null,null,null,null,null,null,"= Birdies or Better",null,null,null,null,{"$f":"Rosters!$B$11","v":"Wisconsin Lutheran"},8,8,8,8,8,null,null,null,null,40]
[]
[]
[]
[]
[]
[]
[]
[]
[]
[]
[]
[]
[]
[]
[]
[]
[]
[]
[]
[]
[]
[]
[]
[]
[]
[]
[]
[]
[]
[]
[]
[]
[]
[]
[]
[]
[]
[]
[]
[]
[]
[]
[]
[]
[]
[null,null,null,null,null,null,null,null,null,null,null,null,null,null,null,null,null,null,null,null,null,null,null,null,null,"`"]
[]
[]
[]
[null,"Course:   ","Oconomowoc Golf Club"]
[null,"Hole   ",1,2,3,4,5,6,7,8,9,"Total"]
[null,"  Par   ",4,4,4,3,4,3,4,5,4,{"$f":"SUM(C102:K102)","v":35}]
[null,"Handicap  ",13,3,7,15,5,17,9,1,11]
[]
[null,"Course:   ","Oconomowoc Golf Club"]
[null,"Hole   ",10,11,12,13,14,15,16,17,18,"Total"]
[null,"  Par   ",4,4,3,4,4,4,5,3,4,{"$f":"SUM(C107:K107)","v":35}]
[null,"Handicap  ",14,10,18,4,12,6,2,16,8]
[]
[]
[]
[]
[]
[]
[null,"Course:   ","Oconomowoc Golf Club"]
[null,"Hole   ",1,2,3,4,5,6,7,8,9,"Total"]
[null,"  Par   ",4,4,4,3,4,3,4,5,4,{"$f":"SUM(C117:K117)","v":35}]
[null,"Handicap  ",13,3,7,15,5,17,9,1,11]
[]
[null,"Course:   ","Oconomowoc Golf Club"]
[null,"Hole   ",10,11,12,13,14,15,16,17,18,"Total"]
[null,"  Par   ",4,4,3,4,4,4,5,3,4,{"$f":"SUM(C122:K122)","v":35}]
[null,"Handicap  ",14,10,18,4,12,6,2,16,8]
[]
[]
[null,"Course:   ","Rolling Hills"]
[null,"Hole   ",1,2,3,4,5,6,7,8,9,"Total"]
[null,"  Par   ",4,3,4,3,5,4,4,5,4,{"$f":"SUM(C128:K128)","v":36}]
[null,"Handicap  ",13,15,5,17,1,7,9,3,11]
[]
[null,"Course:   ","Rolling Hills"]
[null,"Hole   ",10,11,12,13,14,15,16,17,18,"Total"]
[null,"  Par   ",4,4,4,3,5,4,4,3,4,{"$f":"SUM(C133:K133)","v":35}]
[null,"Handicap  ",14,10,12,16,2,4,6,18,8]
[]
[]
[]
[]
[]
[]
[]
[]
[]
[]
[]
[]
[]
[]
[]
[]
[]
[]
[]
[]
[]
[]
[]
[]
[]
[]
[]
[]
[]
[]
[]
[]
[]
[]
[]
[]
[]
[]
[]
[]
[]
[]
[]
[]
[]
[]
[]
[]
[]
[]
[]
[]
[]
[]
[]
[]
[]
[]
[]
[]
[]
[]
[]
[]
[]
[]
[]
[]
[]
[]
[]
[]
[]
[]
[]
[]
[]
[]
[]
[]
[]
[]
[]
[]
[]
[]
[]
[]
[]
[]
[]
[]
[]
[]
[]
[]
[]
[]
[]
[]
[]
[]
[]
[]
[]
[]
[]
[]
[]
[]
[]
[]
[]
[]
[]
[]
[]
[]
[]
[]
[]
[]
[]
[]
[]
[]
[]
[]
[]
[]
[]
[]
[]
[]
[]
[]
[]
[]
[]
[]
[]
[]
[]
[]
[]
[]
[]
[]
[]
[]
[]
[]
[]
[]
[]
[]
[]
[]
[]
[]
[]
[]
[]
[]
[]
[null,"Player","Sc","Sort","Rnk"]
[null,1,{"$f":"$L$8","v":43},null,11]
[null,2,{"$f":"$L$9","v":43},null,11]
[null,3,{"$f":"$L$10","v":42},null,7]
[null,4,{"$f":"$L$11","v":42},null,7]
[null,5,{"$f":"$L$12","v":42},null,7]
[null,6,{"$f":"$L$16","v":42},null,7]
[null,7,{"$f":"$L$17","v":48},null,25]
[null,8,{"$f":"$L$18","v":49},null,30]
[null,9,{"$f":"$L$19","v":46},null,20]
[null,10,{"$f":"$L$20","v":47},null,23]
[null,11,{"$f":"$L$24","v":44},null,14]
[null,12,{"$f":"$L$25","v":39},null,2]
[null,13,{"$f":"$L$26","v":44},null,14]
[null,14,{"$f":"$L$27","v":81},null,37]
[null,15,{"$f":"$L$28","v":44},null,14]
[null,16,{"$f":"$L$32","v":38},null,1]
[null,17,{"$f":"$L$33","v":45},null,17]
[null,18,{"$f":"$L$34","v":43},null,11]
[null,19,{"$f":"$L$35","v":48},null,25]
[null,20,{"$f":"$L$36","v":45},null,17]
[null,21,{"$f":"$AA$8","v":47},null,23]
[null,22,{"$f":"$AA$9","v":48},null,25]
[null,23,{"$f":"$AA$10","v":49},null,30]
[null,24,{"$f":"$AA$11","v":55},null,35]
[null,25,{"$f":"$AA$12","v":48},null,25]
[null,26,{"$f":"$AA$16","v":40},null,3]
[null,27,{"$f":"$AA$17","v":41},null,6]
[null,28,{"$f":"$AA$18","v":51},null,33]
[null,29,{"$f":"$AA$19","v":48},null,25]
[null,30,{"$f":"$AA$20","v":46},null,20]
[null,31,{"$f":"$AA$24","v":46},null,20]
[null,32,{"$f":"$AA$25","v":40},null,3]
[null,33,{"$f":"$AA$26","v":49},null,30]
[null,34,{"$f":"$AA$27","v":53},null,34]
[null,35,{"$f":"$AA$28","v":40},null,3]
[null,36,{"$f":"$AA$32","v":81},null,37]
[null,37,{"$f":"$AA$33","v":81},null,37]
[null,38,{"$f":"$AA$34","v":45},null,17]
[null,39,{"$f":"$AA$35","v":59},null,36]
[null,40,{"$f":"$AA$36","v":81},null,37]
[null,{"$f":"B69","v":0}]
[null,{"$f":"B70","v":0}]
[null,{"$f":"B71","v":0}]
[]
[]
[]
[]
[]
[null,null,null,null,null,null,null,null,null,{"$f":"DCOUNT(J350:J358,1,J347:J348)","v":8},null,null,null,null,null,null,null,"Handicap Holes"]
[null,null,1,2,3,4,5,null,"Tot","Rank",null,"Temp",null,null,null,null,null,{"$f":"IF(SUM($C$4:$K$4)<85,MATCH(1,$C$4:$K$4,0),MATCH(2,$C$4:$K$4,0)+9)","v":8},{"$f":"IF(SUM($C$4:$K$4)<85,MATCH(3,$C$4:$K$4,0),MATCH(4,$C$4:$K$4,0)+9)","v":2},{"$f":"IF(SUM($C$4:$K$4)<85,MATCH(5,$C$4:$K$4,0),MATCH(6,$C$4:$K$4,0)+9)","v":5},{"$f":"IF(SUM($C$4:$K$4)<85,MATCH(7,$C$4:$K$4,0),MATCH(8,$C$4:$K$4,0)+9)","v":3},{"$f":"IF(SUM($C$4:$K$4)<85,MATCH(9,$C$4:$K$4,0),MATCH(10,$C$4:$K$4,0)+9)","v":7},{"$f":"IF(SUM($C$4:$K$4)<85,MATCH(11,$C$4:$K$4,0),MATCH(12,$C$4:$K$4,0)+9)","v":9},{"$f":"IF(SUM($C$4:$K$4)<85,MATCH(13,$C$4:$K$4,0),MATCH(14,$C$4:$K$4,0)+9)","v":1},{"$f":"IF(SUM($C$4:$K$4)<85,MATCH(15,$C$4:$K$4,0),MATCH(16,$C$4:$K$4,0)+9)","v":4},{"$f":"IF(SUM($C$4:$K$4)<85,MATCH(17,$C$4:$K$4,0),MATCH(18,$C$4:$K$4,0)+9)","v":6}]
[null,"Team1",{"$f":"$L$8","v":43},{"$f":"$L$9","v":43},{"$f":"$L$10","v":42},{"$f":"$L$11","v":42},{"$f":"$L$12","v":42},{"$f":"$L$14","v":43},{"$f":"$L$13","v":169},1,null,1,null,null,null,null,null,30,23,22,26,25,25,24,20,17]
[null,"Team2",{"$f":"$L$16","v":42},{"$f":"$L$17","v":48},{"$f":"$L$18","v":49},{"$f":"$L$19","v":46},{"$f":"$L$20","v":47},{"$f":"$L$22","v":49},{"$f":"$L$21","v":183},6,null,6,null,null,null,null,null,30,21,28,29,26,31,23,20,24]
[null,"Team3",{"$f":"$L$24","v":44},{"$f":"$L$25","v":39},{"$f":"$L$26","v":44},{"$f":"$L$27","v":81},{"$f":"$L$28","v":44},{"$f":"$L$30","v":81},{"$f":"$L$29","v":171},3,null,3,null,null,null,null,null,33,30,27,28,30,28,28,24,24]
[null,"Team4",{"$f":"$L$32","v":38},{"$f":"$L$33","v":45},{"$f":"$L$34","v":43},{"$f":"$L$35","v":48},{"$f":"$L$36","v":45},{"$f":"$L$38","v":48},{"$f":"$L$37","v":171},2,null,2,null,null,null,null,null,32,25,24,25,26,25,24,18,20]
[null,"Team5",{"$f":"$AA$8","v":47},{"$f":"$AA$9","v":48},{"$f":"$AA$10","v":49},{"$f":"$AA$11","v":55},{"$f":"$AA$12","v":48},{"$f":"$AA$14","v":55},{"$f":"$AA$13","v":192},7,null,7,null,null,null,null,null,37,28,23,31,26,32,23,24,23]
[null,"Team6",{"$f":"$AA$16","v":40},{"$f":"$AA$17","v":41},{"$f":"$AA$18","v":51},{"$f":"$AA$19","v":48},{"$f":"$AA$20","v":46},{"$f":"$AA$22","v":51},{"$f":"$AA$21","v":175},4,null,4,null,null,null,null,null,26,24,26,25,30,28,24,20,23]
[null,"Team7",{"$f":"$AA$24","v":46},{"$f":"$AA$25","v":40},{"$f":"$AA$26","v":49},{"$f":"$AA$27","v":53},{"$f":"$AA$28","v":40},{"$f":"$AA$30","v":53},{"$f":"$AA$29","v":175},5,null,5,null,null,null,null,null,33,25,29,23,27,25,23,23,20]
[null,"Team8",{"$f":"$AA$32","v":81},{"$f":"$AA$33","v":81},{"$f":"$AA$34","v":45},{"$f":"$AA$35","v":59},{"$f":"$AA$36","v":81},{"$f":"$AA$38","v":81},{"$f":"$AA$37","v":266},8,null,8,null,null,null,null,null,42,38,38,39,38,39,39,39,35]
[]
[]
[]
[]
[]
[]
[]
[]
[]
[]
[]
[]
[]
[]
[]
[]
[]
[]
[]
[]
[]
[]
[]
[]
[]
[]
[]
[]
[]
[]
[]
[]
[]
[]
[]
[]
[]
[]
[]
[]
[]
[]
[null,{"$f":"B8","v":"Koby Jones - 12"},{"$f":"L8","v":43}]
[null,{"$f":"B9","v":"Thomas Bleich - 11"},{"$f":"L9","v":43}]
[null,{"$f":"B10","v":"Cody Trottier - 12"},{"$f":"L10","v":42}]
[null,{"$f":"B11","v":"Jacob Smith - 10"},{"$f":"L11","v":42}]
[null,{"$f":"B12","v":"Carter Smith - 11"},{"$f":"L12","v":42}]
[null,{"$f":"B16","v":"Ryan Ruona - 11"},{"$f":"L16","v":42}]
[null,{"$f":"B17","v":"Adam Butler - 12"},{"$f":"L17","v":48}]
[null,{"$f":"B18","v":"John Turchi - 10"},{"$f":"L18","v":49}]
[null,{"$f":"B19","v":"Lucas Hass - 11"},{"$f":"L19","v":46}]
[null,{"$f":"B20","v":"Luke Carroll - 10"},{"$f":"L20","v":47}]
[null,{"$f":"B24","v":"George Kneiser - 11"},{"$f":"L24","v":44}]
[null,{"$f":"B25","v":"Colin Prom - 12"},{"$f":"L25","v":39}]
[null,{"$f":"B26","v":"Joey Ploch - 9"},{"$f":"L26","v":44}]
[null,{"$f":"B27","v":"Brett Lange - 12"},{"$f":"L27","v":81}]
[null,{"$f":"B28","v":"Allan Moutvic - 12"},{"$f":"L28","v":44}]
[null,{"$f":"B32","v":"Jack Burns - 12"},{"$f":"L32","v":38}]
[null,{"$f":"B33","v":"Chris Evans - 11"},{"$f":"L33","v":45}]
[null,{"$f":"B34","v":"Austin Walsh - 12"},{"$f":"L34","v":43}]
[null,{"$f":"B35","v":"Ryan Erdmann - 10"},{"$f":"L35","v":48}]
[null,{"$f":"B36","v":"Ryan Kusek - 9"},{"$f":"L36","v":45}]
[null,{"$f":"Q8","v":"Cameron Boyd - 11"},{"$f":"AA8","v":47}]
[null,{"$f":"Q9","v":"Alex Thompson - 9"},{"$f":"AA9","v":48}]
[null,{"$f":"Q10","v":"Collin Travis - 11"},{"$f":"AA10","v":49}]
[null,{"$f":"Q11","v":"Austin Douglas - 10"},{"$f":"AA11","v":55}]
[null,{"$f":"Q12","v":"Trevor  Reierson - 11"},{"$f":"AA12","v":48}]
[null,{"$f":"Q16","v":"Devon Hanson - 11"},{"$f":"AA16","v":40}]
[null,{"$f":"Q17","v":"Mitch Saari - 12"},{"$f":"AA17","v":41}]
[null,{"$f":"Q18","v":"Josh Breuer - 12"},{"$f":"AA18","v":51}]
[null,{"$f":"Q19","v":"Sam Struebing - 11"},{"$f":"AA19","v":48}]
[null,{"$f":"Q20","v":"Brad Halverson - 9"},{"$f":"AA20","v":46}]
[null,{"$f":"Q24","v":"Alex Haas - 12"},{"$f":"AA24","v":46}]
[null,{"$f":"Q25","v":"Max Rohlinger - 10"},{"$f":"AA25","v":40}]
[null,{"$f":"Q26","v":"Kevin Albrecht - 11"},{"$f":"AA26","v":49}]
[null,{"$f":"Q27","v":"Jacob Droese - 12"},{"$f":"AA27","v":53}]
[null,{"$f":"Q28","v":"Nick Meucci - 12"},{"$f":"AA28","v":40}]
[null,{"$f":"Q32","v":"Scratch #1 - x"},{"$f":"AA32","v":81}]
[null,{"$f":"Q33","v":"Scratch #2 - x"},{"$f":"AA33","v":81}]
[null,{"$f":"Q34","v":"Ben Krause - 12"},{"$f":"AA34","v":45}]
[null,{"$f":"Q35","v":"Brendan Hausch - 10"},{"$f":"AA35","v":59}]
[null,{"$f":"Q36","v":"Scratch #3 - x"},{"$f":"AA36","v":81}]

{"sheet":"BD","index":5,"n_rows":440,"n_cols":56,"rows_kept":440,"cut":false,"hidden":false,"merged":[[40,16,40,26],[0,2,0,11],[99,2,99,11],[104,2,104,11],[46,1,48,12]]}
[null,"Course:   ","Old Hickory Golf Club"]
[null,"Hole   ",10,11,12,13,14,15,16,17,18,"Total",null,null,null,null,"Hole   ",{"$f":"C2","v":10},11,12,13,14,15,16,17,18,"Total"]
[null,"  Par   ",4,4,3,4,4,4,5,3,5,{"$f":"SUM(C3:K3)","v":36},null,null,null,null,"  Par   ",4,4,3,4,4,4,5,3,5,{"$f":"L3","v":36}]
[null,"Handicap  ",4,8,16,12,2,14,10,18,6,null,null,null,null,null,"Handicap  ",4,8,16,12,2,14,10,18,6]
[]
[]
["Player","BEAVER DAM",null,null,null,null,null,null,null,null,null,null,"Place",null,null,"Player","WATERTOWN",null,null,null,null,null,null,null,null,null,null,"Place"]
[1,"Koby Jones - 12",5,4,4,4,6,5,5,3,6,{"$f":"IF(COUNTBLANK(C8:K8)>0,\"\",SUM(C8:K8))","v":42},{"$f":"VLOOKUP(BA8,$B$301:$E$340,4)","v":9},null,null,1,"Cameron Boyd - 11",8,5,3,5,6,3,5,4,11,{"$f":"IF(COUNTBLANK(R8:Z8)>0,\"\",SUM(R8:Z8))","v":50},{"$f":"VLOOKUP(BB8,$B$301:$E$340,4)","v":30},null,null,null,null,null,null,null,null,null,null,null,null,null,null,null,null,null,null,null,null,null,null,null,null,1,21,{"$f":"LEN(L8)","v":2},{"$f":"LEN(AA8)","v":2}]
[2,"Thomas Bleich - 11",4,4,4,6,6,5,4,2,6,{"$f":"IF(COUNTBLANK(C9:K9)>0,\"\",SUM(C9:K9))","v":41},{"$f":"VLOOKUP(BA9,$B$301:$E$340,4)","v":6},null,null,2,"Alex Thompson - 9",5,4,4,5,5,5,6,4,9,{"$f":"IF(COUNTBLANK(R9:Z9)>0,\"\",SUM(R9:Z9))","v":47},{"$f":"VLOOKUP(BB9,$B$301:$E$340,4)","v":21},null,null,null,null,null,null,null,null,null,null,null,null,null,null,null,null,null,null,null,null,null,null,null,null,2,22,{"$f":"LEN(L9)","v":2},{"$f":"LEN(AA9)","v":2}]
[3,"Cody Trottier - 12",4,5,3,5,6,5,5,3,7,{"$f":"IF(COUNTBLANK(C10:K10)>0,\"\",SUM(C10:K10))","v":43},{"$f":"VLOOKUP(BA10,$B$301:$E$340,4)","v":12},null,null,3,"Collin Travis - 11",5,5,3,5,7,5,6,3,6,{"$f":"IF(COUNTBLANK(R10:Z10)>0,\"\",SUM(R10:Z10))","v":45},{"$f":"VLOOKUP(BB10,$B$301:$E$340,4)","v":19},null,null,null,null,null,null,null,null,null,null,null,null,null,null,null,null,null,null,null,null,null,null,null,null,3,23,{"$f":"LEN(L10)","v":2},{"$f":"LEN(AA10)","v":2}]
[4,"Jacob Smith - 10",4,5,4,8,5,4,5,4,5,{"$f":"IF(COUNTBLANK(C11:K11)>0,\"\",SUM(C11:K11))","v":44},{"$f":"VLOOKUP(BA11,$B$301:$E$340,4)","v":15},null,null,4,"Austin Douglas - 10",6,6,9,6,6,6,6,8,5,{"$f":"IF(COUNTBLANK(R11:Z11)>0,\"\",SUM(R11:Z11))","v":58},{"$f":"VLOOKUP(BB11,$B$301:$E$340,4)","v":37},null,null,null,null,null,null,null,null,null,null,null,null,null,null,null,null,null,null,null,null,null,null,null,null,4,24,{"$f":"LEN(L11)","v":2},{"$f":"LEN(AA11)","v":2}]
[5,"Carter Smith - 11",5,5,4,5,5,5,5,3,4,{"$f":"IF(COUNTBLANK(C12:K12)>0,\"\",SUM(C12:K12))","v":41},{"$f":"VLOOKUP(BA12,$B$301:$E$340,4)","v":6},null,null,5,"Trevor  Reierson - 11",5,7,4,6,6,5,7,5,7,{"$f":"IF(COUNTBLANK(R12:Z12)>0,\"\",SUM(R12:Z12))","v":52},{"$f":"VLOOKUP(BB12,$B$301:$E$340,4)","v":32},null,null,null,null,null,null,null,null,null,null,null,null,null,null,null,null,null,null,null,null,null,null,null,null,5,25,{"$f":"LEN(L12)","v":2},{"$f":"LEN(AA12)","v":2}]
[null,null,null,null,null,null,null,null,null,null,null,{"$f":"IF(COUNT(L8:L12)=5,(SUM(L8:L12))-(MAX(L8:L12)),(IF(COUNT(L8:L12)=4,SUM(L8:L12),IF(COUNTBLANK(L8:L12)>0,SUM(L8:L12),\"DQ\"))))","v":167},{"$f":"J351","v":2},null,null,null,null,null,null,null,null,null,null,null,null,null,{"$f":"IF(COUNT(AA8:AA12)=5,(SUM(AA8:AA12))-(MAX(AA8:AA12)),(IF(COUNT(AA8:AA12)=4,SUM(AA8:AA12),IF(COUNTBLANK(AA8:AA12)>0,SUM(AA8:AA12),\"DQ\"))))","v":194},{"$f":"J355","v":7}]
[null,null,null,null,null,null,null,null,null,null,null,{"$f":"IF(COUNT(L8:L12)=5,MAX(L8:L12),IF(COUNT(L8:L12)<5,200,))","v":44},null,null,null,null,null,null,null,null,null,null,null,null,null,null,{"$f":"IF(COUNT(AA8:AA12)=5,MAX(AA8:AA12),IF(COUNT(AA8:AA12)<5,200,))","v":58}]
["Player","HARTFORD",null,null,null,null,null,null,null,null,null,null,"Place",null,null,"Player","WEST BEND EAST",null,null,null,null,null,null,null,null,null,null,"Place"]
[1,"Ryan Ruona - 11",5,4,5,5,6,5,6,4,7,{"$f":"IF(COUNTBLANK(C16:K16)>0,\"\",SUM(C16:K16))","v":47},{"$f":"VLOOKUP(BA16,$B$301:$E$340,4)","v":21},null,null,1,"Devon Hanson - 11",5,5,3,4,4,4,5,3,5,{"$f":"IF(COUNTBLANK(R16:Z16)>0,\"\",SUM(R16:Z16))","v":38},{"$f":"VLOOKUP(BB16,$B$301:$E$340,4)","v":2},null,null,null,null,null,null,null,null,null,null,null,null,null,null,null,null,null,null,null,null,null,null,null,null,6,26,{"$f":"LEN(L16)","v":2},{"$f":"LEN(AA16)","v":2}]
[2,"Adam Butler - 12",5,8,3,4,6,6,6,3,6,{"$f":"IF(COUNTBLANK(C17:K17)>0,\"\",SUM(C17:K17))","v":47},{"$f":"VLOOKUP(BA17,$B$301:$E$340,4)","v":21},null,null,2,"Mitch Saari - 12",5,4,4,4,4,4,5,4,5,{"$f":"IF(COUNTBLANK(R17:Z17)>0,\"\",SUM(R17:Z17))","v":39},{"$f":"VLOOKUP(BB17,$B$301:$E$340,4)","v":3},null,null,null,null,null,null,null,null,null,null,null,null,null,null,null,null,null,null,null,null,null,null,null,null,7,27,{"$f":"LEN(L17)","v":2},{"$f":"LEN(AA17)","v":2}]
[3,"John Turchi - 10",6,4,3,6,5,5,5,4,6,{"$f":"IF(COUNTBLANK(C18:K18)>0,\"\",SUM(C18:K18))","v":44},{"$f":"VLOOKUP(BA18,$B$301:$E$340,4)","v":15},null,null,3,"Sam Struebing - 11",6,5,5,5,6,5,8,2,7,{"$f":"IF(COUNTBLANK(R18:Z18)>0,\"\",SUM(R18:Z18))","v":49},{"$f":"VLOOKUP(BB18,$B$301:$E$340,4)","v":29},null,null,null,null,null,null,null,null,null,null,null,null,null,null,null,null,null,null,null,null,null,null,null,null,8,28,{"$f":"LEN(L18)","v":2},{"$f":"LEN(AA18)","v":2}]
[4,"Lucas Hass - 11",7,4,4,4,6,5,6,6,5,{"$f":"IF(COUNTBLANK(C19:K19)>0,\"\",SUM(C19:K19))","v":47},{"$f":"VLOOKUP(BA19,$B$301:$E$340,4)","v":21},null,null,4,"Josh Breuer - 12",6,6,5,6,6,6,8,5,6,{"$f":"IF(COUNTBLANK(R19:Z19)>0,\"\",SUM(R19:Z19))","v":54},{"$f":"VLOOKUP(BB19,$B$301:$E$340,4)","v":35},null,null,null,null,null,null,null,null,null,null,null,null,null,null,null,null,null,null,null,null,null,null,null,null,9,29,{"$f":"LEN(L19)","v":2},{"$f":"LEN(AA19)","v":2}]
[5,"Luke Carroll - 10",5,5,5,6,5,5,8,4,7,{"$f":"IF(COUNTBLANK(C20:K20)>0,\"\",SUM(C20:K20))","v":50},{"$f":"VLOOKUP(BA20,$B$301:$E$340,4)","v":30},null,null,5,"Brad Halverson - 9",6,6,4,6,14,6,7,5,6,{"$f":"IF(COUNTBLANK(R20:Z20)>0,\"\",SUM(R20:Z20))","v":60},{"$f":"VLOOKUP(BB20,$B$301:$E$340,4)","v":38},null,null,null,null,null,null,null,null,null,null,null,null,null,null,null,null,null,null,null,null,null,null,null,null,10,30,{"$f":"LEN(L20)","v":2},{"$f":"LEN(AA20)","v":2}]
[null,null,null,null,null,null,null,null,null,null,null,{"$f":"IF(COUNT(L16:L20)=5,(SUM(L16:L20))-(MAX(L16:L20)),(IF(COUNT(L16:L20)=4,SUM(L16:L20),IF(COUNTBLANK(L16:L20)>0,SUM(L16:L20),\"DQ\"))))","v":185},{"$f":"J352","v":6},null,null,null,null,null,null,null,null,null,null,null,null,null,{"$f":"IF(COUNT(AA16:AA20)=5,(SUM(AA16:AA20))-(MAX(AA16:AA20)),(IF(COUNT(AA16:AA20)=4,SUM(AA16:AA20),IF(COUNTBLANK(AA16:AA20)>0,SUM(AA16:AA20),\"DQ\"))))","v":180},5]
[null,null,null,null,null,null,null,null,null,null,null,{"$f":"IF(COUNT(L16:L20)=5,MAX(L16:L20),IF(COUNT(L16:L20)<5,200,))","v":50},null,null,null,null,null,null,null,null,null,null,null,null,null,null,{"$f":"IF(COUNT(AA16:AA20)=5,MAX(AA16:AA20),IF(COUNT(AA16:AA20)<5,200,))","v":60}]
["Player","OCONOMOWOC",null,null,null,null,null,null,null,null,null,null,"Place",null,null,"Player","WEST BEND WEST",null,null,null,null,null,null,null,null,null,null,"Place"]
[1,"George Kneiser - 11",4,4,4,4,4,3,4,3,5,{"$f":"IF(COUNTBLANK(C24:K24)>0,\"\",SUM(C24:K24))","v":35},{"$f":"VLOOKUP(BA24,$B$301:$E$340,4)","v":1},null,null,1,"Alex Haas - 12",4,4,4,6,6,4,5,5,5,{"$f":"IF(COUNTBLANK(R24:Z24)>0,\"\",SUM(R24:Z24))","v":43},{"$f":"VLOOKUP(BB24,$B$301:$E$340,4)","v":12},null,null,null,null,null,null,null,null,null,null,null,null,null,null,null,null,null,null,null,null,null,null,null,null,11,31,{"$f":"LEN(L24)","v":2},{"$f":"LEN(AA24)","v":2}]
[2,"Colin Prom - 12",6,6,3,5,5,4,5,4,6,{"$f":"IF(COUNTBLANK(C25:K25)>0,\"\",SUM(C25:K25))","v":44},{"$f":"VLOOKUP(BA25,$B$301:$E$340,4)","v":15},null,null,2,"Max Rohlinger - 10",5,5,4,4,4,4,5,3,7,{"$f":"IF(COUNTBLANK(R25:Z25)>0,\"\",SUM(R25:Z25))","v":41},{"$f":"VLOOKUP(BB25,$B$301:$E$340,4)","v":6},null,null,null,null,null,null,null,null,null,null,null,null,null,null,null,null,null,null,null,null,null,null,null,null,12,32,{"$f":"LEN(L25)","v":2},{"$f":"LEN(AA25)","v":2}]
[3,"Joey Ploch - 9",5,6,6,6,6,5,5,3,5,{"$f":"IF(COUNTBLANK(C26:K26)>0,\"\",SUM(C26:K26))","v":47},{"$f":"VLOOKUP(BA26,$B$301:$E$340,4)","v":21},null,null,3,"Kevin Albrecht - 11",4,4,3,4,6,4,5,4,6,{"$f":"IF(COUNTBLANK(R26:Z26)>0,\"\",SUM(R26:Z26))","v":40},{"$f":"VLOOKUP(BB26,$B$301:$E$340,4)","v":4},null,null,null,null,null,null,null,null,null,null,null,null,null,null,null,null,null,null,null,null,null,null,null,null,13,33,{"$f":"LEN(L26)","v":2},{"$f":"LEN(AA26)","v":2}]
[4,"Brett Lange - 12",6,5,4,4,7,5,5,5,7,{"$f":"IF(COUNTBLANK(C27:K27)>0,\"\",SUM(C27:K27))","v":48},{"$f":"VLOOKUP(BA27,$B$301:$E$340,4)","v":28},null,null,4,"Jacob Droese - 12",5,4,4,5,5,5,6,3,6,{"$f":"IF(COUNTBLANK(R27:Z27)>0,\"\",SUM(R27:Z27))","v":43},{"$f":"VLOOKUP(BB27,$B$301:$E$340,4)","v":12},null,null,null,null,null,null,null,null,null,null,null,null,null,null,null,null,null,null,null,null,null,null,null,null,14,34,{"$f":"LEN(L27)","v":2},{"$f":"LEN(AA27)","v":2}]
[5,"Allan Moutvic - 12",5,5,4,4,6,5,5,4,6,{"$f":"IF(COUNTBLANK(C28:K28)>0,\"\",SUM(C28:K28))","v":44},{"$f":"VLOOKUP(BA28,$B$301:$E$340,4)","v":15},null,null,5,"Nick Meucci - 12",4,6,3,4,5,6,4,3,5,{"$f":"IF(COUNTBLANK(R28:Z28)>0,\"\",SUM(R28:Z28))","v":40},{"$f":"VLOOKUP(BB28,$B$301:$E$340,4)","v":4},null,null,null,null,null,null,null,null,null,null,null,null,null,null,null,null,null,null,null,null,null,null,null,null,15,35,{"$f":"LEN(L28)","v":2},{"$f":"LEN(AA28)","v":2}]
[null,null,null,null,null,null,null,null,null,null,null,{"$f":"IF(COUNT(L24:L28)=5,(SUM(L24:L28))-(MAX(L24:L28)),(IF(COUNT(L24:L28)=4,SUM(L24:L28),IF(COUNTBLANK(L24:L28)>0,SUM(L24:L28),\"DQ\"))))","v":170},{"$f":"J353","v":3},null,null,null,null,null,null,null,null,null,null,null,null,null,{"$f":"IF(COUNT(AA24:AA28)=5,(SUM(AA24:AA28))-(MAX(AA24:AA28)),(IF(COUNT(AA24:AA28)=4,SUM(AA24:AA28),IF(COUNTBLANK(AA24:AA28)>0,SUM(AA24:AA28),\"DQ\"))))","v":164},{"$f":"J357","v":1}]
[null,null,null,null,null,null,null,null,null,null,null,{"$f":"IF(COUNT(L24:L28)=5,MAX(L24:L28),IF(COUNT(L24:L28)<5,200,))","v":48},null,null,null,null,null,null,null,null,null,null,null,null,null,null,{"$f":"IF(COUNT(AA24:AA28)=5,MAX(AA24:AA28),IF(COUNT(AA24:AA28)<5,200,))","v":43}]
["Player","SLINGER",null,null,null,null,null,null,null,null,null,null,"Place",null,null,"Player","WISCONSIN LUTHERAN",null,null,null,null,null,null,null,null,null,null,"Place"]
[1,"Jack Burns - 12",5,4,4,6,5,5,5,3,5,{"$f":"IF(COUNTBLANK(C32:K32)>0,\"\",SUM(C32:K32))","v":42},{"$f":"VLOOKUP(BA32,$B$301:$E$340,4)","v":9},null,null,1,"Scratch #1 - x",9,9,9,9,9,9,9,9,9,{"$f":"IF(COUNTBLANK(R32:Z32)>0,\"\",SUM(R32:Z32))","v":81},{"$f":"VLOOKUP(BB32,$B$301:$E$340,4)","v":39},null,null,null,null,null,null,null,null,null,null,null,null,null,null,null,null,null,null,null,null,null,null,null,null,16,36,{"$f":"LEN(L32)","v":2},{"$f":"LEN(AA32)","v":2}]
[2,"Chris Evans - 11",6,4,5,4,6,5,8,3,6,{"$f":"IF(COUNTBLANK(C33:K33)>0,\"\",SUM(C33:K33))","v":47},{"$f":"VLOOKUP(BA33,$B$301:$E$340,4)","v":21},null,null,2,"Scratch #2 - x",9,9,9,9,9,9,9,9,9,{"$f":"IF(COUNTBLANK(R33:Z33)>0,\"\",SUM(R33:Z33))","v":81},{"$f":"VLOOKUP(BB33,$B$301:$E$340,4)","v":39},null,null,null,null,null,null,null,null,null,null,null,null,null,null,null,null,null,null,null,null,null,null,null,null,17,37,{"$f":"LEN(L33)","v":2},{"$f":"LEN(AA33)","v":2}]
[3,"Austin Walsh - 12",4,5,4,3,5,5,7,3,6,{"$f":"IF(COUNTBLANK(C34:K34)>0,\"\",SUM(C34:K34))","v":42},{"$f":"VLOOKUP(BA34,$B$301:$E$340,4)","v":9},null,null,3,"Zachary Stahle - 12",5,4,4,5,5,4,5,7,8,{"$f":"IF(COUNTBLANK(R34:Z34)>0,\"\",SUM(R34:Z34))","v":47},{"$f":"VLOOKUP(BB34,$B$301:$E$340,4)","v":21},null,null,null,null,null,null,null,null,null,null,null,null,null,null,null,null,null,null,null,null,null,null,null,null,18,38,{"$f":"LEN(L34)","v":2},{"$f":"LEN(AA34)","v":2}]
[4,"Ryan Erdmann - 10",8,5,6,6,7,6,7,4,7,{"$f":"IF(COUNTBLANK(C35:K35)>0,\"\",SUM(C35:K35))","v":56},{"$f":"VLOOKUP(BA35,$B$301:$E$340,4)","v":36},null,null,4,"Ben Krause - 12",6,5,4,7,8,7,6,3,6,{"$f":"IF(COUNTBLANK(R35:Z35)>0,\"\",SUM(R35:Z35))","v":52},{"$f":"VLOOKUP(BB35,$B$301:$E$340,4)","v":32},null,null,null,null,null,null,null,null,null,null,null,null,null,null,null,null,null,null,null,null,null,null,null,null,19,39,{"$f":"LEN(L35)","v":2},{"$f":"LEN(AA35)","v":2}]
[5,"Ryan Kusek - 9",6,6,3,5,5,4,7,4,6,{"$f":"IF(COUNTBLANK(C36:K36)>0,\"\",SUM(C36:K36))","v":46},{"$f":"VLOOKUP(BA36,$B$301:$E$340,4)","v":20},null,null,5,"Brendan Hausch - 10",6,6,4,6,6,4,7,6,7,{"$f":"IF(COUNTBLANK(R36:Z36)>0,\"\",SUM(R36:Z36))","v":52},{"$f":"VLOOKUP(BB36,$B$301:$E$340,4)","v":32},null,null,null,null,null,null,null,null,null,null,null,null,null,null,null,null,null,null,null,null,null,null,null,null,20,40,{"$f":"LEN(L36)","v":2},{"$f":"LEN(AA36)","v":2}]
[null,null,null,null,null,null,null,null,null,null,null,{"$f":"IF(COUNT(L32:L36)=5,(SUM(L32:L36))-(MAX(L32:L36)),(IF(COUNT(L32:L36)=4,SUM(L32:L36),IF(COUNTBLANK(L32:L36)>0,SUM(L32:L36),\"DQ\"))))","v":177},4,null,null,null,null,null,null,null,null,null,null,null,null,null,{"$f":"IF(COUNT(AA32:AA36)=5,(SUM(AA32:AA36))-(MAX(AA32:AA36)),(IF(COUNT(AA32:AA36)=4,SUM(AA32:AA36),IF(COUNTBLANK(AA32:AA36)>0,SUM(AA32:AA36),\"DQ\"))))","v":232},{"$f":"J358","v":8}]
[null,null,null,null,null,null,null,null,null,null,null,{"$f":"IF(COUNT(L32:L36)=5,MAX(L32:L36),IF(COUNT(L32:L36)<5,200,))","v":56},null,null,null,null,null,null,null,null,null,null,null,null,null,null,{"$f":"IF(COUNT(AA32:AA36)=5,MAX(AA32:AA36),IF(COUNT(AA32:AA36)<5,200,))","v":81}]
[]
[]
[null,"Wisconsin Little Ten Varsity Golf",null,null,null,null,"Match # 6",null,null,null,null,"Hosted By: ","Beaver Dam",null,null,null,{"$f":"\"WISCONSIN LITTLE TEN CONFERENCE STANDINGS \" & Schedule!Q41","v":"WISCONSIN LITTLE TEN CONFERENCE STANDINGS "}]
[null,null,null,null,null,null,null,null,null,null,null,null,null,null,null,null,"Match  ","1",2,3,4,5,6,7,8,9,"Total"]
[null,"Date: May 6, 2015",null,{"$f":"\"Location: \" & C1","v":"Location: Old Hickory Golf Club"},null,null,null,null,null,null,null,null,null,null,null,null,{"$f":"Rosters!$B$10","v":"West Bend West"},1,1,2,2,5,1,null,null,null,{"$f":"IF(SUM(R43:Z43)=0,\"\",SUM(R43:Z43))","v":12}]
[null,null,null,null,null,null,null,null,null,null,null,null,null,null,null,null,{"$f":"Rosters!$B$6","v":"Oconomowoc"},2,3,3,1,3,3,null,null,null,15]
[null,null,null,null,null,null,null,null,null,null,null,null,null,null,null,null,{"$f":"Rosters!$B$4","v":"Beaver Dam"},3,2,4,6,1,2,null,null,null,18]
[null,null,null,null,null,null,null,null,null,null,null,null,null,null,null,null,{"$f":"Rosters!$B$7","v":"Slinger"},4,6,1,3,2,4,null,null,null,20]
[null,"Medalist: (35) - George Kneiser",null,null,null,null,null,null,null,null,null,null,null,null,null,null,{"$f":"Rosters!$B$9","v":"West Bend East"},5,4,6,5,4,5,null,null,null,29]
[null,null,null,null,null,null,null,null,null,null,null,null,null,null,null,null,{"$f":"Rosters!$B$5","v":"Hartford"},6,5,5,4,6,6,null,null,null,32]
[null,null,null,null,null,null,null,null,null,null,null,null,null,null,null,null,{"$f":"Rosters!$B$8","v":"Watertown"},7,7,7,7,7,7,null,null,null,42]
[null,null,null,null,null,null,null,null,null,null,null,"= Birdies or Better",null,null,null,null,{"$f":"Rosters!$B$11","v":"Wisconsin Lutheran"},8,8,8,8,8,8,null,null,null,48]
[]
[]
[]
[]
[]
[]
[]
[]
[]
[]
[]
[]
[]
[]
[]
[]
[]
[]
[]
[]
[]
[]
[]
[]
[]
[]
[]
[]
[]
[]
[]
[]
[]
[]
[]
[]
[]
[]
[]
[]
[]
[]
[]
[]
[]
[]
[]
[]
[]
[null,"Course:   ","Old Hickory Golf Club"]
[null,"Hole   ",1,2,3,4,5,6,7,8,9,"Total"]
[null,"  Par   ",4,4,3,5,4,5,3,4,4,{"$f":"SUM(C102:K102)","v":36}]
[null,"Handicap  ",11,9,17,7,3,1,15,13,5]
[]
[null,"Course:   ","Old Hickory Golf Club"]
[null,"Hole   ",10,11,12,13,14,15,16,17,18,"Total"]
[null,"  Par   ",4,4,3,4,4,4,5,3,5,{"$f":"SUM(C107:K107)","v":36}]
[null,"Handicap  ",4,8,16,12,2,14,10,18,6]
[]
[]
[]
[]
[]
[]
[]
[]
[]
[]
[]
[]
[]
[]
[]
[]
[]
[]
[]
[]
[]
[]
[]
[]
[]
[]
[]
[]
[]
[]
[]
[]
[]
[]
[]
[]
[]
[]
[]
[]
[]
[]
[]
[]
[]
[]
[]
[]
[]
[]
[]
[]
[]
[]
[]
[]
[]
[]
[]
[]
[]
[]
[]
[]
[]
[]
[]
[]
[]
[]
[]
[]
[]
[]
[]
[]
[]
[]
[]
[]
[]
[]
[]
[]
[]
[]
[]
[]
[]
[]
[]
[]
[]
[]
[]
[]
[]
[]
[]
[]
[]
[]
[]
[]
[]
[]
[]
[]
[]
[]
[]
[]
[]
[]
[]
[]
[]
[]
[]
[]
[]
[]
[]
[]
[]
[]
[]
[]
[]
[]
[]
[]
[]
[]
[]
[]
[]
[]
[]
[]
[]
[]
[]
[]
[]
[]
[]
[]
[]
[]
[]
[]
[]
[]
[]
[]
[]
[]
[]
[]
[]
[]
[]
[]
[]
[]
[]
[]
[]
[]
[]
[]
[]
[]
[]
[]
[]
[]
[]
[]
[]
[]
[]
[]
[]
[]
[]
[]
[]
[]
[]
[null,"Player","Sc","Sort","Rnk"]
[null,1,{"$f":"$L$8","v":42},null,9]
[null,2,{"$f":"$L$9","v":41},null,6]
[null,3,{"$f":"$L$10","v":43},null,12]
[null,4,{"$f":"$L$11","v":44},null,15]
[null,5,{"$f":"$L$12","v":41},null,6]
[null,6,{"$f":"$L$16","v":47},null,21]
[null,7,{"$f":"$L$17","v":47},null,21]
[null,8,{"$f":"$L$18","v":44},null,15]
[null,9,{"$f":"$L$19","v":47},null,21]
[null,10,{"$f":"$L$20","v":50},null,30]
[null,11,{"$f":"$L$24","v":35},null,1]
[null,12,{"$f":"$L$25","v":44},null,15]
[null,13,{"$f":"$L$26","v":47},null,21]
[null,14,{"$f":"$L$27","v":48},null,28]
[null,15,{"$f":"$L$28","v":44},null,15]
[null,16,{"$f":"$L$32","v":42},null,9]
[null,17,{"$f":"$L$33","v":47},null,21]
[null,18,{"$f":"$L$34","v":42},null,9]
[null,19,{"$f":"$L$35","v":56},null,36]
[null,20,{"$f":"$L$36","v":46},null,20]
[null,21,{"$f":"$AA$8","v":50},null,30]
[null,22,{"$f":"$AA$9","v":47},null,21]
[null,23,{"$f":"$AA$10","v":45},null,19]
[null,24,{"$f":"$AA$11","v":58},null,37]
[null,25,{"$f":"$AA$12","v":52},null,32]
[null,26,{"$f":"$AA$16","v":38},null,2]
[null,27,{"$f":"$AA$17","v":39},null,3]
[null,28,{"$f":"$AA$18","v":49},null,29]
[null,29,{"$f":"$AA$19","v":54},null,35]
[null,30,{"$f":"$AA$20","v":60},null,38]
[null,31,{"$f":"$AA$24","v":43},null,12]
[null,32,{"$f":"$AA$25","v":41},null,6]
[null,33,{"$f":"$AA$26","v":40},null,4]
[null,34,{"$f":"$AA$27","v":43},null,12]
[null,35,{"$f":"$AA$28","v":40},null,4]
[null,36,{"$f":"$AA$32","v":81},null,39]
[null,37,{"$f":"$AA$33","v":81},null,39]
[null,38,{"$f":"$AA$34","v":47},null,21]
[null,39,{"$f":"$AA$35","v":52},null,32]
[null,40,{"$f":"$AA$36","v":52},null,32]
[null,{"$f":"B69","v":0}]
[null,{"$f":"B70","v":0}]
[null,{"$f":"B71","v":0}]
[]
[]
[]
[]
[]
[null,null,null,null,null,null,null,null,null,{"$f":"DCOUNT(J350:J358,1,J347:J348)","v":8},null,null,null,null,null,null,null,"Handicap Holes"]
[null,null,1,2,3,4,5,null,"Tot","Rank",null,"Temp",null,null,null,null,null,{"$f":"IF(SUM($C$4:$K$4)<85,MATCH(1,$C$4:$K$4,0),MATCH(2,$C$4:$K$4,0)+9)","v":14},{"$f":"IF(SUM($C$4:$K$4)<85,MATCH(3,$C$4:$K$4,0),MATCH(4,$C$4:$K$4,0)+9)","v":10},{"$f":"IF(SUM($C$4:$K$4)<85,MATCH(5,$C$4:$K$4,0),MATCH(6,$C$4:$K$4,0)+9)","v":18},{"$f":"IF(SUM($C$4:$K$4)<85,MATCH(7,$C$4:$K$4,0),MATCH(8,$C$4:$K$4,0)+9)","v":11},{"$f":"IF(SUM($C$4:$K$4)<85,MATCH(9,$C$4:$K$4,0),MATCH(10,$C$4:$K$4,0)+9)","v":16},{"$f":"IF(SUM($C$4:$K$4)<85,MATCH(11,$C$4:$K$4,0),MATCH(12,$C$4:$K$4,0)+9)","v":13},{"$f":"IF(SUM($C$4:$K$4)<85,MATCH(13,$C$4:$K$4,0),MATCH(14,$C$4:$K$4,0)+9)","v":15},{"$f":"IF(SUM($C$4:$K$4)<85,MATCH(15,$C$4:$K$4,0),MATCH(16,$C$4:$K$4,0)+9)","v":12},{"$f":"IF(SUM($C$4:$K$4)<85,MATCH(17,$C$4:$K$4,0),MATCH(18,$C$4:$K$4,0)+9)","v":17}]
[null,"Team1",{"$f":"$L$8","v":42},{"$f":"$L$9","v":41},{"$f":"$L$10","v":43},{"$f":"$L$11","v":44},{"$f":"$L$12","v":41},{"$f":"$L$14","v":44},{"$f":"$L$13","v":167},2,null,2,null,null,null,null,null,15,211,23,48,29,0,0,0,27]
[null,"Team2",{"$f":"$L$16","v":47},{"$f":"$L$17","v":47},{"$f":"$L$18","v":44},{"$f":"$L$19","v":47},{"$f":"$L$20","v":50},{"$f":"$L$22","v":50},{"$f":"$L$21","v":185},6,null,6,null,null,null,null,null,15,235,21,108,28,0,0,0,26]
[null,"Team3",{"$f":"$L$24","v":35},{"$f":"$L$25","v":44},{"$f":"$L$26","v":47},{"$f":"$L$27","v":48},{"$f":"$L$28","v":44},{"$f":"$L$30","v":48},{"$f":"$L$29","v":170},3,null,3,null,null,null,null,null,15,218,18,80,22,0,0,0,23]
[null,"Team4",{"$f":"$L$32","v":42},{"$f":"$L$33","v":47},{"$f":"$L$34","v":42},{"$f":"$L$35","v":56},{"$f":"$L$36","v":46},{"$f":"$L$38","v":56},{"$f":"$L$37","v":177},4,null,4,null,null,null,null,null,15,233,30,95,35,0,0,0,33]
[null,"Team5",{"$f":"$AA$8","v":50},{"$f":"$AA$9","v":47},{"$f":"$AA$10","v":45},{"$f":"$AA$11","v":58},{"$f":"$AA$12","v":52},{"$f":"$AA$14","v":58},{"$f":"$AA$13","v":194},7,null,7,null,null,null,null,null,0,252,0,139,0,0,0,0,0]
[null,"Team6",{"$f":"$AA$16","v":38},{"$f":"$AA$17","v":39},{"$f":"$AA$18","v":49},{"$f":"$AA$19","v":54},{"$f":"$AA$20","v":60},{"$f":"$AA$22","v":60},{"$f":"$AA$21","v":180},5,null,5,null,null,null,null,null,0,240,0,107,0,0,0,0,0]
[null,"Team7",{"$f":"$AA$24","v":43},{"$f":"$AA$25","v":41},{"$f":"$AA$26","v":40},{"$f":"$AA$27","v":43},{"$f":"$AA$28","v":40},{"$f":"$AA$30","v":43},{"$f":"$AA$29","v":164},1,null,1,null,null,null,null,null,0,207,0,38,0,0,0,0,0]
[null,"Team8",{"$f":"$AA$32","v":81},{"$f":"$AA$33","v":81},{"$f":"$AA$34","v":47},{"$f":"$AA$35","v":52},{"$f":"$AA$36","v":52},{"$f":"$AA$38","v":81},{"$f":"$AA$37","v":232},8,null,8,null,null,null,null,null,0,313,0,163,0,0,0,0,0]
[]
[]
[]
[]
[]
[]
[]
[]
[]
[]
[]
[]
[]
[]
[]
[]
[]
[]
[]
[]
[]
[]
[]
[]
[]
[]
[]
[]
[]
[]
[]
[]
[]
[]
[]
[]
[]
[]
[]
[]
[]
[]
[null,{"$f":"B8","v":"Koby Jones - 12"},{"$f":"L8","v":42}]
[null,{"$f":"B9","v":"Thomas Bleich - 11"},{"$f":"L9","v":41}]
[null,{"$f":"B10","v":"Cody Trottier - 12"},{"$f":"L10","v":43}]
[null,{"$f":"B11","v":"Jacob Smith - 10"},{"$f":"L11","v":44}]
[null,{"$f":"B12","v":"Carter Smith - 11"},{"$f":"L12","v":41}]
[null,{"$f":"B16","v":"Ryan Ruona - 11"},{"$f":"L16","v":47}]
[null,{"$f":"B17","v":"Adam Butler - 12"},{"$f":"L17","v":47}]
[null,{"$f":"B18","v":"John Turchi - 10"},{"$f":"L18","v":44}]
[null,{"$f":"B19","v":"Lucas Hass - 11"},{"$f":"L19","v":47}]
[null,{"$f":"B20","v":"Luke Carroll - 10"},{"$f":"L20","v":50}]
[null,{"$f":"B24","v":"George Kneiser - 11"},{"$f":"L24","v":35}]
[null,{"$f":"B25","v":"Colin Prom - 12"},{"$f":"L25","v":44}]
[null,{"$f":"B26","v":"Joey Ploch - 9"},{"$f":"L26","v":47}]
[null,{"$f":"B27","v":"Brett Lange - 12"},{"$f":"L27","v":48}]
[null,{"$f":"B28","v":"Allan Moutvic - 12"},{"$f":"L28","v":44}]
[null,{"$f":"B32","v":"Jack Burns - 12"},{"$f":"L32","v":42}]
[null,{"$f":"B33","v":"Chris Evans - 11"},{"$f":"L33","v":47}]
[null,{"$f":"B34","v":"Austin Walsh - 12"},{"$f":"L34","v":42}]
[null,{"$f":"B35","v":"Ryan Erdmann - 10"},{"$f":"L35","v":56}]
[null,{"$f":"B36","v":"Ryan Kusek - 9"},{"$f":"L36","v":46}]
[null,{"$f":"Q8","v":"Cameron Boyd - 11"},{"$f":"AA8","v":50}]
[null,{"$f":"Q9","v":"Alex Thompson - 9"},{"$f":"AA9","v":47}]
[null,{"$f":"Q10","v":"Collin Travis - 11"},{"$f":"AA10","v":45}]
[null,{"$f":"Q11","v":"Austin Douglas - 10"},{"$f":"AA11","v":58}]
[null,{"$f":"Q12","v":"Trevor  Reierson - 11"},{"$f":"AA12","v":52}]
[null,{"$f":"Q16","v":"Devon Hanson - 11"},{"$f":"AA16","v":38}]
[null,{"$f":"Q17","v":"Mitch Saari - 12"},{"$f":"AA17","v":39}]
[null,{"$f":"Q18","v":"Sam Struebing - 11"},{"$f":"AA18","v":49}]
[null,{"$f":"Q19","v":"Josh Breuer - 12"},{"$f":"AA19","v":54}]
[null,{"$f":"Q20","v":"Brad Halverson - 9"},{"$f":"AA20","v":60}]
[null,{"$f":"Q24","v":"Alex Haas - 12"},{"$f":"AA24","v":43}]
[null,{"$f":"Q25","v":"Max Rohlinger - 10"},{"$f":"AA25","v":41}]
[null,{"$f":"Q26","v":"Kevin Albrecht - 11"},{"$f":"AA26","v":40}]
[null,{"$f":"Q27","v":"Jacob Droese - 12"},{"$f":"AA27","v":43}]
[null,{"$f":"Q28","v":"Nick Meucci - 12"},{"$f":"AA28","v":40}]
[null,{"$f":"Q32","v":"Scratch #1 - x"},{"$f":"AA32","v":81}]
[null,{"$f":"Q33","v":"Scratch #2 - x"},{"$f":"AA33","v":81}]
[null,{"$f":"Q34","v":"Zachary Stahle - 12"},{"$f":"AA34","v":47}]
[null,{"$f":"Q35","v":"Ben Krause - 12"},{"$f":"AA35","v":52}]
[null,{"$f":"Q36","v":"Brendan Hausch - 10"},{"$f":"AA36","v":52}]

{"sheet":"HT","index":6,"n_rows":440,"n_cols":56,"rows_kept":440,"cut":false,"hidden":false,"merged":[[40,16,40,26],[0,2,0,11],[99,2,99,11],[104,2,104,11],[46,1,48,12]]}
[null,"Course:   ","Hartford Golf Club"]
[null,"Hole   ",1,2,3,4,5,6,7,8,9,"Total",null,null,null,null,"Hole   ",{"$f":"C2","v":1},2,3,4,5,6,7,8,9,"Total"]
[null,"  Par   ",4,4,5,3,4,5,4,3,4,{"$f":"SUM(C3:K3)","v":36},null,null,null,null,"  Par   ",4,4,5,3,4,5,4,3,4,{"$f":"L3","v":36}]
[null,"Handicap  ",7,5,1,15,11,3,13,17,9,null,null,null,null,null,"Handicap  ",7,5,1,15,11,3,13,17,9]
[]
[]
["Player","BEAVER DAM",null,null,null,null,null,null,null,null,null,null,"Place",null,null,"Player","WATERTOWN",null,null,null,null,null,null,null,null,null,null,"Place"]
[1,"Koby Jones - 12",5,5,4,4,5,6,5,3,5,{"$f":"IF(COUNTBLANK(C8:K8)>0,\"\",SUM(C8:K8))","v":42},{"$f":"VLOOKUP(BA8,$B$301:$E$340,4)","v":6},null,null,1,"Cameron Boyd - 11",5,6,5,5,6,8,6,5,5,{"$f":"IF(COUNTBLANK(R8:Z8)>0,\"\",SUM(R8:Z8))","v":51},{"$f":"VLOOKUP(BB8,$B$301:$E$340,4)","v":34},null,null,null,null,null,null,null,null,null,null,null,null,null,null,null,null,null,null,null,null,null,null,null,null,1,21,{"$f":"LEN(L8)","v":2},{"$f":"LEN(AA8)","v":2}]
[2,"Thomas Bleich - 11",5,5,5,3,3,5,4,5,5,{"$f":"IF(COUNTBLANK(C9:K9)>0,\"\",SUM(C9:K9))","v":40},{"$f":"VLOOKUP(BA9,$B$301:$E$340,4)","v":5},null,null,2,"Alex Thompson - 9",6,7,8,6,6,5,7,4,5,{"$f":"IF(COUNTBLANK(R9:Z9)>0,\"\",SUM(R9:Z9))","v":54},{"$f":"VLOOKUP(BB9,$B$301:$E$340,4)","v":37},null,null,null,null,null,null,null,null,null,null,null,null,null,null,null,null,null,null,null,null,null,null,null,null,2,22,{"$f":"LEN(L9)","v":2},{"$f":"LEN(AA9)","v":2}]
[3,"Cody Trotter - 12",6,5,4,5,6,6,4,5,4,{"$f":"IF(COUNTBLANK(C10:K10)>0,\"\",SUM(C10:K10))","v":45},{"$f":"VLOOKUP(BA10,$B$301:$E$340,4)","v":17},null,null,3,"Collin Travis - 11",4,4,6,3,4,4,5,4,5,{"$f":"IF(COUNTBLANK(R10:Z10)>0,\"\",SUM(R10:Z10))","v":39},{"$f":"VLOOKUP(BB10,$B$301:$E$340,4)","v":2},null,null,null,null,null,null,null,null,null,null,null,null,null,null,null,null,null,null,null,null,null,null,null,null,3,23,{"$f":"LEN(L10)","v":2},{"$f":"LEN(AA10)","v":2}]
[4,"Jacob Smith - 10",6,5,6,4,5,5,5,3,5,{"$f":"IF(COUNTBLANK(C11:K11)>0,\"\",SUM(C11:K11))","v":44},{"$f":"VLOOKUP(BA11,$B$301:$E$340,4)","v":14},null,null,4,"Austin Douglas - 10",6,5,6,3,4,5,5,4,4,{"$f":"IF(COUNTBLANK(R11:Z11)>0,\"\",SUM(R11:Z11))","v":42},{"$f":"VLOOKUP(BB11,$B$301:$E$340,4)","v":6},null,null,null,null,null,null,null,null,null,null,null,null,null,null,null,null,null,null,null,null,null,null,null,null,4,24,{"$f":"LEN(L11)","v":2},{"$f":"LEN(AA11)","v":2}]
[5,"Carter Smith - 11",7,4,5,3,5,7,5,5,5,{"$f":"IF(COUNTBLANK(C12:K12)>0,\"\",SUM(C12:K12))","v":46},{"$f":"VLOOKUP(BA12,$B$301:$E$340,4)","v":20},null,null,5,"Trevor  Reierson - 11",6,5,8,3,9,6,6,4,6,{"$f":"IF(COUNTBLANK(R12:Z12)>0,\"\",SUM(R12:Z12))","v":53},{"$f":"VLOOKUP(BB12,$B$301:$E$340,4)","v":35},null,null,null,null,null,null,null,null,null,null,null,null,null,null,null,null,null,null,null,null,null,null,null,null,5,25,{"$f":"LEN(L12)","v":2},{"$f":"LEN(AA12)","v":2}]
[null,null,null,null,null,null,null,null,null,null,null,{"$f":"IF(COUNT(L8:L12)=5,(SUM(L8:L12))-(MAX(L8:L12)),(IF(COUNT(L8:L12)=4,SUM(L8:L12),IF(COUNTBLANK(L8:L12)>0,SUM(L8:L12),\"DQ\"))))","v":171},{"$f":"J351","v":2},null,null,null,null,null,null,null,null,null,null,null,null,null,{"$f":"IF(COUNT(AA8:AA12)=5,(SUM(AA8:AA12))-(MAX(AA8:AA12)),(IF(COUNT(AA8:AA12)=4,SUM(AA8:AA12),IF(COUNTBLANK(AA8:AA12)>0,SUM(AA8:AA12),\"DQ\"))))","v":185},{"$f":"J355","v":7}]
[null,null,null,null,null,null,null,null,null,null,null,{"$f":"IF(COUNT(L8:L12)=5,MAX(L8:L12),IF(COUNT(L8:L12)<5,200,))","v":46},null,null,null,null,null,null,null,null,null,null,null,null,null,null,{"$f":"IF(COUNT(AA8:AA12)=5,MAX(AA8:AA12),IF(COUNT(AA8:AA12)<5,200,))","v":54}]
["Player","HARTFORD",null,null,null,null,null,null,null,null,null,null,"Place",null,null,"Player","WEST BEND EAST",null,null,null,null,null,null,null,null,null,null,"Place"]
[1,"Ryan Ruona - 11",5,6,6,3,5,5,4,4,4,{"$f":"IF(COUNTBLANK(C16:K16)>0,\"\",SUM(C16:K16))","v":42},{"$f":"VLOOKUP(BA16,$B$301:$E$340,4)","v":6},null,null,1,"Devon Hanson - 11",5,5,6,4,3,5,6,3,5,{"$f":"IF(COUNTBLANK(R16:Z16)>0,\"\",SUM(R16:Z16))","v":42},{"$f":"VLOOKUP(BB16,$B$301:$E$340,4)","v":6},null,null,null,null,null,null,null,null,null,null,null,null,null,null,null,null,null,null,null,null,null,null,null,null,6,26,{"$f":"LEN(L16)","v":2},{"$f":"LEN(AA16)","v":2}]
[2,"Adam Butler - 12",5,7,4,5,6,4,7,3,5,{"$f":"IF(COUNTBLANK(C17:K17)>0,\"\",SUM(C17:K17))","v":46},{"$f":"VLOOKUP(BA17,$B$301:$E$340,4)","v":20},null,null,2,"Mitch Saari - 12",6,5,5,5,5,4,6,5,4,{"$f":"IF(COUNTBLANK(R17:Z17)>0,\"\",SUM(R17:Z17))","v":45},{"$f":"VLOOKUP(BB17,$B$301:$E$340,4)","v":17},null,null,null,null,null,null,null,null,null,null,null,null,null,null,null,null,null,null,null,null,null,null,null,null,7,27,{"$f":"LEN(L17)","v":2},{"$f":"LEN(AA17)","v":2}]
[3,"Luke Carroll - 10",5,6,6,5,5,6,5,3,5,{"$f":"IF(COUNTBLANK(C18:K18)>0,\"\",SUM(C18:K18))","v":46},{"$f":"VLOOKUP(BA18,$B$301:$E$340,4)","v":20},null,null,3,"Sam Struebing - 11",8,5,6,4,5,5,8,4,5,{"$f":"IF(COUNTBLANK(R18:Z18)>0,\"\",SUM(R18:Z18))","v":50},{"$f":"VLOOKUP(BB18,$B$301:$E$340,4)","v":33},null,null,null,null,null,null,null,null,null,null,null,null,null,null,null,null,null,null,null,null,null,null,null,null,8,28,{"$f":"LEN(L18)","v":2},{"$f":"LEN(AA18)","v":2}]
[4,"Lucas Hass - 11",5,5,6,5,5,6,6,4,5,{"$f":"IF(COUNTBLANK(C19:K19)>0,\"\",SUM(C19:K19))","v":47},{"$f":"VLOOKUP(BA19,$B$301:$E$340,4)","v":26},null,null,4,"Josh Breuer - 12",6,5,6,4,6,6,6,4,5,{"$f":"IF(COUNTBLANK(R19:Z19)>0,\"\",SUM(R19:Z19))","v":48},{"$f":"VLOOKUP(BB19,$B$301:$E$340,4)","v":29},null,null,null,null,null,null,null,null,null,null,null,null,null,null,null,null,null,null,null,null,null,null,null,null,9,29,{"$f":"LEN(L19)","v":2},{"$f":"LEN(AA19)","v":2}]
[5,"Mike Vanderheiden - 10",8,6,7,4,5,7,5,6,5,{"$f":"IF(COUNTBLANK(C20:K20)>0,\"\",SUM(C20:K20))","v":53},{"$f":"VLOOKUP(BA20,$B$301:$E$340,4)","v":35},null,null,5,"Brad Halverson - 9",7,5,6,4,4,6,6,4,6,{"$f":"IF(COUNTBLANK(R20:Z20)>0,\"\",SUM(R20:Z20))","v":48},{"$f":"VLOOKUP(BB20,$B$301:$E$340,4)","v":29},null,null,null,null,null,null,null,null,null,null,null,null,null,null,null,null,null,null,null,null,null,null,null,null,10,30,{"$f":"LEN(L20)","v":2},{"$f":"LEN(AA20)","v":2}]
[null,null,null,null,null,null,null,null,null,null,null,{"$f":"IF(COUNT(L16:L20)=5,(SUM(L16:L20))-(MAX(L16:L20)),(IF(COUNT(L16:L20)=4,SUM(L16:L20),IF(COUNTBLANK(L16:L20)>0,SUM(L16:L20),\"DQ\"))))","v":181},{"$f":"J352","v":5},null,null,null,null,null,null,null,null,null,null,null,null,null,{"$f":"IF(COUNT(AA16:AA20)=5,(SUM(AA16:AA20))-(MAX(AA16:AA20)),(IF(COUNT(AA16:AA20)=4,SUM(AA16:AA20),IF(COUNTBLANK(AA16:AA20)>0,SUM(AA16:AA20),\"DQ\"))))","v":183},{"$f":"J356","v":6}]
[null,null,null,null,null,null,null,null,null,null,null,{"$f":"IF(COUNT(L16:L20)=5,MAX(L16:L20),IF(COUNT(L16:L20)<5,200,))","v":53},null,null,null,null,null,null,null,null,null,null,null,null,null,null,{"$f":"IF(COUNT(AA16:AA20)=5,MAX(AA16:AA20),IF(COUNT(AA16:AA20)<5,200,))","v":50}]
["Player","OCONOMOWOC",null,null,null,null,null,null,null,null,null,null,"Place",null,null,"Player","WEST BEND WEST",null,null,null,null,null,null,null,null,null,null,"Place"]
[1,"George Kneiser - 11",4,5,5,3,5,4,4,4,4,{"$f":"IF(COUNTBLANK(C24:K24)>0,\"\",SUM(C24:K24))","v":38},{"$f":"VLOOKUP(BA24,$B$301:$E$340,4)","v":1},null,null,1,"Alex Haas - 12",4,4,4,4,5,6,4,3,5,{"$f":"IF(COUNTBLANK(R24:Z24)>0,\"\",SUM(R24:Z24))","v":39},{"$f":"VLOOKUP(BB24,$B$301:$E$340,4)","v":2},null,null,null,null,null,null,null,null,null,null,null,null,null,null,null,null,null,null,null,null,null,null,null,null,11,31,{"$f":"LEN(L24)","v":2},{"$f":"LEN(AA24)","v":2}]
[2,"Colin Prom - 12",4,6,6,5,4,5,5,3,5,{"$f":"IF(COUNTBLANK(C25:K25)>0,\"\",SUM(C25:K25))","v":43},{"$f":"VLOOKUP(BA25,$B$301:$E$340,4)","v":12},null,null,2,"Max Rohlinger - 10",5,5,6,5,4,4,5,4,5,{"$f":"IF(COUNTBLANK(R25:Z25)>0,\"\",SUM(R25:Z25))","v":43},{"$f":"VLOOKUP(BB25,$B$301:$E$340,4)","v":12},null,null,null,null,null,null,null,null,null,null,null,null,null,null,null,null,null,null,null,null,null,null,null,null,12,32,{"$f":"LEN(L25)","v":2},{"$f":"LEN(AA25)","v":2}]
[3,"Joey Ploch - 9",6,5,5,6,4,5,5,4,6,{"$f":"IF(COUNTBLANK(C26:K26)>0,\"\",SUM(C26:K26))","v":46},{"$f":"VLOOKUP(BA26,$B$301:$E$340,4)","v":20},null,null,3,"Kevin Albrecht - 11",4,6,5,5,4,5,5,3,5,{"$f":"IF(COUNTBLANK(R26:Z26)>0,\"\",SUM(R26:Z26))","v":42},{"$f":"VLOOKUP(BB26,$B$301:$E$340,4)","v":6},null,null,null,null,null,null,null,null,null,null,null,null,null,null,null,null,null,null,null,null,null,null,null,null,13,33,{"$f":"LEN(L26)","v":2},{"$f":"LEN(AA26)","v":2}]
[4,"Brett Lange - 12",6,5,5,5,4,6,6,4,4,{"$f":"IF(COUNTBLANK(C27:K27)>0,\"\",SUM(C27:K27))","v":45},{"$f":"VLOOKUP(BA27,$B$301:$E$340,4)","v":17},null,null,4,"Jacob Droese - 12",5,4,6,4,5,4,6,3,5,{"$f":"IF(COUNTBLANK(R27:Z27)>0,\"\",SUM(R27:Z27))","v":42},{"$f":"VLOOKUP(BB27,$B$301:$E$340,4)","v":6},null,null,null,null,null,null,null,null,null,null,null,null,null,null,null,null,null,null,null,null,null,null,null,null,14,34,{"$f":"LEN(L27)","v":2},{"$f":"LEN(AA27)","v":2}]
[5,"Drew Cook - 11",5,7,5,7,5,6,5,4,5,{"$f":"IF(COUNTBLANK(C28:K28)>0,\"\",SUM(C28:K28))","v":49},{"$f":"VLOOKUP(BA28,$B$301:$E$340,4)","v":31},null,null,5,"Nick Meucci - 12",5,4,5,4,4,6,5,6,5,{"$f":"IF(COUNTBLANK(R28:Z28)>0,\"\",SUM(R28:Z28))","v":44},{"$f":"VLOOKUP(BB28,$B$301:$E$340,4)","v":14},null,null,null,null,null,null,null,null,null,null,null,null,null,null,null,null,null,null,null,null,null,null,null,null,15,35,{"$f":"LEN(L28)","v":2},{"$f":"LEN(AA28)","v":2}]
[null,null,null,null,null,null,null,null,null,null,null,{"$f":"IF(COUNT(L24:L28)=5,(SUM(L24:L28))-(MAX(L24:L28)),(IF(COUNT(L24:L28)=4,SUM(L24:L28),IF(COUNTBLANK(L24:L28)>0,SUM(L24:L28),\"DQ\"))))","v":172},{"$f":"J353","v":3},null,null,null,null,null,null,null,null,null,null,null,null,null,{"$f":"IF(COUNT(AA24:AA28)=5,(SUM(AA24:AA28))-(MAX(AA24:AA28)),(IF(COUNT(AA24:AA28)=4,SUM(AA24:AA28),IF(COUNTBLANK(AA24:AA28)>0,SUM(AA24:AA28),\"DQ\"))))","v":166},{"$f":"J357","v":1}]
[null,null,null,null,null,null,null,null,null,null,null,{"$f":"IF(COUNT(L24:L28)=5,MAX(L24:L28),IF(COUNT(L24:L28)<5,200,))","v":49},null,null,null,null,null,null,null,null,null,null,null,null,null,null,{"$f":"IF(COUNT(AA24:AA28)=5,MAX(AA24:AA28),IF(COUNT(AA24:AA28)<5,200,))","v":44}]
["Player","SLINGER",null,null,null,null,null,null,null,null,null,null,"Place",null,null,"Player","WISCONSIN LUTHERAN",null,null,null,null,null,null,null,null,null,null,"Place"]
[1,"Jack Burns - 12",6,6,5,4,6,5,6,3,5,{"$f":"IF(COUNTBLANK(C32:K32)>0,\"\",SUM(C32:K32))","v":46},{"$f":"VLOOKUP(BA32,$B$301:$E$340,4)","v":20},null,null,1,"Scratch #1 - x",9,9,9,9,9,9,9,9,9,{"$f":"IF(COUNTBLANK(R32:Z32)>0,\"\",SUM(R32:Z32))","v":81},{"$f":"VLOOKUP(BB32,$B$301:$E$340,4)","v":39},null,null,null,null,null,null,null,null,null,null,null,null,null,null,null,null,null,null,null,null,null,null,null,null,16,36,{"$f":"LEN(L32)","v":2},{"$f":"LEN(AA32)","v":2}]
[2,"Ryan Graunke - 12",8,4,5,4,5,6,5,5,5,{"$f":"IF(COUNTBLANK(C33:K33)>0,\"\",SUM(C33:K33))","v":47},{"$f":"VLOOKUP(BA33,$B$301:$E$340,4)","v":26},null,null,2,"Scratch #2 - x",9,9,9,9,9,9,9,9,9,{"$f":"IF(COUNTBLANK(R33:Z33)>0,\"\",SUM(R33:Z33))","v":81},{"$f":"VLOOKUP(BB33,$B$301:$E$340,4)","v":39},null,null,null,null,null,null,null,null,null,null,null,null,null,null,null,null,null,null,null,null,null,null,null,null,17,37,{"$f":"LEN(L33)","v":2},{"$f":"LEN(AA33)","v":2}]
[3,"Austin Walsh - 12",5,4,5,3,4,5,6,3,4,{"$f":"IF(COUNTBLANK(C34:K34)>0,\"\",SUM(C34:K34))","v":39},{"$f":"VLOOKUP(BA34,$B$301:$E$340,4)","v":2},null,null,3,"Zachary Stahle - 12",5,5,6,4,4,9,7,4,5,{"$f":"IF(COUNTBLANK(R34:Z34)>0,\"\",SUM(R34:Z34))","v":49},{"$f":"VLOOKUP(BB34,$B$301:$E$340,4)","v":31},null,null,null,null,null,null,null,null,null,null,null,null,null,null,null,null,null,null,null,null,null,null,null,null,18,38,{"$f":"LEN(L34)","v":2},{"$f":"LEN(AA34)","v":2}]
[4,"Nick Gliniecki - ",6,4,6,4,5,5,6,5,6,{"$f":"IF(COUNTBLANK(C35:K35)>0,\"\",SUM(C35:K35))","v":47},{"$f":"VLOOKUP(BA35,$B$301:$E$340,4)","v":26},null,null,4,"Ben Krause - 12",6,6,6,3,5,5,5,5,5,{"$f":"IF(COUNTBLANK(R35:Z35)>0,\"\",SUM(R35:Z35))","v":46},{"$f":"VLOOKUP(BB35,$B$301:$E$340,4)","v":20},null,null,null,null,null,null,null,null,null,null,null,null,null,null,null,null,null,null,null,null,null,null,null,null,19,39,{"$f":"LEN(L35)","v":2},{"$f":"LEN(AA35)","v":2}]
[5,"Ryan Kusek - 9",5,6,6,3,4,6,5,4,5,{"$f":"IF(COUNTBLANK(C36:K36)>0,\"\",SUM(C36:K36))","v":44},{"$f":"VLOOKUP(BA36,$B$301:$E$340,4)","v":14},null,null,5,"Brendan Hausch - 10",8,8,7,5,6,8,6,4,6,{"$f":"IF(COUNTBLANK(R36:Z36)>0,\"\",SUM(R36:Z36))","v":58},{"$f":"VLOOKUP(BB36,$B$301:$E$340,4)","v":38},null,null,null,null,null,null,null,null,null,null,null,null,null,null,null,null,null,null,null,null,null,null,null,null,20,40,{"$f":"LEN(L36)","v":2},{"$f":"LEN(AA36)","v":2}]
[null,null,null,null,null,null,null,null,null,null,null,{"$f":"IF(COUNT(L32:L36)=5,(SUM(L32:L36))-(MAX(L32:L36)),(IF(COUNT(L32:L36)=4,SUM(L32:L36),IF(COUNTBLANK(L32:L36)>0,SUM(L32:L36),\"DQ\"))))","v":176},{"$f":"J354","v":4},null,null,null,null,null,null,null,null,null,null,null,null,null,{"$f":"IF(COUNT(AA32:AA36)=5,(SUM(AA32:AA36))-(MAX(AA32:AA36)),(IF(COUNT(AA32:AA36)=4,SUM(AA32:AA36),IF(COUNTBLANK(AA32:AA36)>0,SUM(AA32:AA36),\"DQ\"))))","v":234},{"$f":"J358","v":8}]
[null,null,null,null,null,null,null,null,null,null,null,{"$f":"IF(COUNT(L32:L36)=5,MAX(L32:L36),IF(COUNT(L32:L36)<5,200,))","v":47},null,null,null,null,null,null,null,null,null,null,null,null,null,null,{"$f":"IF(COUNT(AA32:AA36)=5,MAX(AA32:AA36),IF(COUNT(AA32:AA36)<5,200,))","v":81}]
[]
[]
[null,"Wisconsin Little Ten Varsity Golf",null,null,null,null,"Match # 7",null,null,null,null,"Hosted By: ","Hartford",null,null,null,{"$f":"\"WISCONSIN LITTLE TEN CONFERENCE STANDINGS \" & Schedule!Q41","v":"WISCONSIN LITTLE TEN CONFERENCE STANDINGS "}]
[null,null,null,null,null,null,null,null,null,null,null,null,null,null,null,null,"Match  ","1",2,3,4,5,6,7,8,9,"Total"]
[null,"Date: May 12, 2015",null,{"$f":"\"Location: \" & C1","v":"Location: Hartford Golf Club"},null,null,null,null,null,null,null,null,null,null,null,null,{"$f":"Rosters!$B$10","v":"West Bend West"},1,1,2,2,5,1,1,null,null,{"$f":"IF(SUM(R43:Z43)=0,\"\",SUM(R43:Z43))","v":13}]
[null,"Weather - Cold, 45, gusty winds 15-20mph, more like what we're used to",null,null,null,null,null,null,null,null,null,null,null,null,null,null,{"$f":"Rosters!$B$6","v":"Oconomowoc"},2,3,3,1,3,3,3,null,null,18]
[null,null,null,null,null,null,null,null,null,null,null,null,null,null,null,null,{"$f":"Rosters!$B$4","v":"Beaver Dam"},3,2,4,6,1,2,2,null,null,20]
[null,null,null,null,null,null,null,null,null,null,null,null,null,null,null,null,{"$f":"Rosters!$B$7","v":"Slinger"},4,6,1,3,2,4,4,null,null,24]
[null,"Medalist: (38) - George Kneiser",null,null,null,null,null,null,null,null,null,null,null,null,null,null,{"$f":"Rosters!$B$9","v":"West Bend East"},5,4,6,5,4,5,6,null,null,35]
[null,null,null,null,null,null,null,null,null,null,null,null,null,null,null,null,{"$f":"Rosters!$B$5","v":"Hartford"},6,5,5,4,6,6,5,null,null,37]
[null,null,null,null,null,null,null,null,null,null,null,null,null,null,null,null,{"$f":"Rosters!$B$8","v":"Watertown"},7,7,7,7,7,7,7,null,null,49]
[null,null,null,null,null,null,null,null,null,null,null,"= Birdies or Better",null,null,null,null,{"$f":"Rosters!$B$11","v":"Wisconsin Lutheran"},8,8,8,8,8,8,8,null,null,56]
[]
[]
[]
[]
[]
[]
[]
[]
[]
[]
[]
[]
[]
[]
[]
[]
[]
[]
[]
[]
[]
[]
[]
[]
[]
[]
[]
[]
[]
[]
[]
[]
[]
[]
[]
[]
[]
[]
[]
[]
[]
[]
[]
[]
[]
[]
[]
[]
[]
[null,"Course:   ","Hartford Golf Club"]
[null,"Hole   ",1,2,3,4,5,6,7,8,9,"Total"]
[null,"  Par   ",4,4,5,3,4,5,4,3,4,{"$f":"SUM(C102:K102)","v":36}]
[null,"Handicap  ",7,5,1,15,11,3,13,17,9]
[]
[null,"Course:   ","Hartford Golf Club"]
[null,"Hole   ",10,11,12,13,14,15,16,17,18,"Total"]
[null,"  Par   ",5,3,5,4,4,4,4,3,4,{"$f":"SUM(C107:K107)","v":36}]
[null,"Handicap  ",4,16,2,14,12,6,8,18,10]
[]
[]
[]
[]
[]
[]
[]
[]
[]
[]
[]
[]
[]
[]
[]
[]
[]
[]
[]
[]
[]
[]
[]
[]
[]
[]
[]
[]
[]
[]
[]
[]
[]
[]
[]
[]
[]
[]
[]
[]
[]
[]
[]
[]
[]
[]
[]
[]
[]
[]
[]
[]
[]
[]
[]
[]
[]
[]
[]
[]
[]
[]
[]
[]
[]
[]
[]
[]
[]
[]
[]
[]
[]
[]
[]
[]
[]
[]
[]
[]
[]
[]
[]
[]
[]
[]
[]
[]
[]
[]
[]
[]
[]
[]
[]
[]
[]
[]
[]
[]
[]
[]
[]
[]
[]
[]
[]
[]
[]
[]
[]
[]
[]
[]
[]
[]
[]
[]
[]
[]
[]
[]
[]
[]
[]
[]
[]
[]
[]
[]
[]
[]
[]
[]
[]
[]
[]
[]
[]
[]
[]
[]
[]
[]
[]
[]
[]
[]
[]
[]
[]
[]
[]
[]
[]
[]
[]
[]
[]
[]
[]
[]
[]
[]
[]
[]
[]
[]
[]
[]
[]
[]
[]
[]
[]
[]
[]
[]
[]
[]
[]
[]
[]
[]
[]
[]
[]
[]
[]
[]
[]
[null,"Player","Sc","Sort","Rnk"]
[null,1,{"$f":"$L$8","v":42},null,6]
[null,2,{"$f":"$L$9","v":40},null,5]
[null,3,{"$f":"$L$10","v":45},null,17]
[null,4,{"$f":"$L$11","v":44},null,14]
[null,5,{"$f":"$L$12","v":46},null,20]
[null,6,{"$f":"$L$16","v":42},null,6]
[null,7,{"$f":"$L$17","v":46},null,20]
[null,8,{"$f":"$L$18","v":46},null,20]
[null,9,{"$f":"$L$19","v":47},null,26]
[null,10,{"$f":"$L$20","v":53},null,35]
[null,11,{"$f":"$L$24","v":38},null,1]
[null,12,{"$f":"$L$25","v":43},null,12]
[null,13,{"$f":"$L$26","v":46},null,20]
[null,14,{"$f":"$L$27","v":45},null,17]
[null,15,{"$f":"$L$28","v":49},null,31]
[null,16,{"$f":"$L$32","v":46},null,20]
[null,17,{"$f":"$L$33","v":47},null,26]
[null,18,{"$f":"$L$34","v":39},null,2]
[null,19,{"$f":"$L$35","v":47},null,26]
[null,20,{"$f":"$L$36","v":44},null,14]
[null,21,{"$f":"$AA$8","v":51},null,34]
[null,22,{"$f":"$AA$9","v":54},null,37]
[null,23,{"$f":"$AA$10","v":39},null,2]
[null,24,{"$f":"$AA$11","v":42},null,6]
[null,25,{"$f":"$AA$12","v":53},null,35]
[null,26,{"$f":"$AA$16","v":42},null,6]
[null,27,{"$f":"$AA$17","v":45},null,17]
[null,28,{"$f":"$AA$18","v":50},null,33]
[null,29,{"$f":"$AA$19","v":48},null,29]
[null,30,{"$f":"$AA$20","v":48},null,29]
[null,31,{"$f":"$AA$24","v":39},null,2]
[null,32,{"$f":"$AA$25","v":43},null,12]
[null,33,{"$f":"$AA$26","v":42},null,6]
[null,34,{"$f":"$AA$27","v":42},null,6]
[null,35,{"$f":"$AA$28","v":44},null,14]
[null,36,{"$f":"$AA$32","v":81},null,39]
[null,37,{"$f":"$AA$33","v":81},null,39]
[null,38,{"$f":"$AA$34","v":49},null,31]
[null,39,{"$f":"$AA$35","v":46},null,20]
[null,40,{"$f":"$AA$36","v":58},null,38]
[null,{"$f":"B69","v":0}]
[null,{"$f":"B70","v":0}]
[null,{"$f":"B71","v":0}]
[]
[]
[]
[]
[]
[null,null,null,null,null,null,null,null,null,{"$f":"DCOUNT(J350:J358,1,J347:J348)","v":8}]
[null,null,1,2,3,4,5,null,"Tot","Rank"]
[null,"Team1",{"$f":"$L$8","v":42},{"$f":"$L$9","v":40},{"$f":"$L$10","v":45},{"$f":"$L$11","v":44},{"$f":"$L$12","v":46},{"$f":"$L$14","v":46},{"$f":"$L$13","v":171},2,null,2,null,null,null,null,null,0,0,0,0,0,0,0,0,0]
[null,"Team2",{"$f":"$L$16","v":42},{"$f":"$L$17","v":46},{"$f":"$L$18","v":46},{"$f":"$L$19","v":47},{"$f":"$L$20","v":53},{"$f":"$L$22","v":53},{"$f":"$L$21","v":181},5,null,5,null,null,null,null,null,0,0,0,0,0,0,0,0,0]
[null,"Team3",{"$f":"$L$24","v":38},{"$f":"$L$25","v":43},{"$f":"$L$26","v":46},{"$f":"$L$27","v":45},{"$f":"$L$28","v":49},{"$f":"$L$30","v":49},{"$f":"$L$29","v":172},3,null,3,null,null,null,null,null,0,0,0,0,0,0,0,0,0]
[null,"Team4",{"$f":"$L$32","v":46},{"$f":"$L$33","v":47},{"$f":"$L$34","v":39},{"$f":"$L$35","v":47},{"$f":"$L$36","v":44},{"$f":"$L$38","v":47},{"$f":"$L$37","v":176},4,null,4,null,null,null,null,null,0,0,0,0,0,0,0,0,0]
[null,"Team5",{"$f":"$AA$8","v":51},{"$f":"$AA$9","v":54},{"$f":"$AA$10","v":39},{"$f":"$AA$11","v":42},{"$f":"$AA$12","v":53},{"$f":"$AA$14","v":54},{"$f":"$AA$13","v":185},7,null,7,null,null,null,null,null,0,0,0,0,0,0,0,0,0]
[null,"Team6",{"$f":"$AA$16","v":42},{"$f":"$AA$17","v":45},{"$f":"$AA$18","v":50},{"$f":"$AA$19","v":48},{"$f":"$AA$20","v":48},{"$f":"$AA$22","v":50},{"$f":"$AA$21","v":183},6,null,6,null,null,null,null,null,0,0,0,0,0,0,0,0,0]
[null,"Team7",{"$f":"$AA$24","v":39},{"$f":"$AA$25","v":43},{"$f":"$AA$26","v":42},{"$f":"$AA$27","v":42},{"$f":"$AA$28","v":44},{"$f":"$AA$30","v":44},{"$f":"$AA$29","v":166},1,null,1,null,null,null,null,null,0,0,0,0,0,0,0,0,0]
[null,"Team8",{"$f":"$AA$32","v":81},{"$f":"$AA$33","v":81},{"$f":"$AA$34","v":49},{"$f":"$AA$35","v":46},{"$f":"$AA$36","v":58},{"$f":"$AA$38","v":81},{"$f":"$AA$37","v":234},8,null,8,null,null,null,null,null,0,0,0,0,0,0,0,0,0]
[]
[]
[]
[]
[]
[]
[]
[]
[]
[]
[]
[]
[]
[]
[]
[]
[]
[]
[]
[]
[]
[]
[]
[]
[]
[]
[]
[]
[]
[]
[]
[]
[]
[]
[]
[]
[]
[]
[]
[]
[]
[]
[null,{"$f":"B8","v":"Koby Jones - 12"},{"$f":"L8","v":42}]
[null,{"$f":"B9","v":"Thomas Bleich - 11"},{"$f":"L9","v":40}]
[null,{"$f":"B10","v":"Cody Trotter - 12"},{"$f":"L10","v":45}]
[null,{"$f":"B11","v":"Jacob Smith - 10"},{"$f":"L11","v":44}]
[null,{"$f":"B12","v":"Carter Smith - 11"},{"$f":"L12","v":46}]
[null,{"$f":"B16","v":"Ryan Ruona - 11"},{"$f":"L16","v":42}]
[null,{"$f":"B17","v":"Adam Butler - 12"},{"$f":"L17","v":46}]
[null,{"$f":"B18","v":"Luke Carroll - 10"},{"$f":"L18","v":46}]
[null,{"$f":"B19","v":"Lucas Hass - 11"},{"$f":"L19","v":47}]
[null,{"$f":"B20","v":"Mike Vanderheiden - 10"},{"$f":"L20","v":53}]
[null,{"$f":"B24","v":"George Kneiser - 11"},{"$f":"L24","v":38}]
[null,{"$f":"B25","v":"Colin Prom - 12"},{"$f":"L25","v":43}]
[null,{"$f":"B26","v":"Joey Ploch - 9"},{"$f":"L26","v":46}]
[null,{"$f":"B27","v":"Brett Lange - 12"},{"$f":"L27","v":45}]
[null,{"$f":"B28","v":"Drew Cook - 11"},{"$f":"L28","v":49}]
[null,{"$f":"B32","v":"Jack Burns - 12"},{"$f":"L32","v":46}]
[null,{"$f":"B33","v":"Ryan Graunke - 12"},{"$f":"L33","v":47}]
[null,{"$f":"B34","v":"Austin Walsh - 12"},{"$f":"L34","v":39}]
[null,{"$f":"B35","v":"Nick Gliniecki - "},{"$f":"L35","v":47}]
[null,{"$f":"B36","v":"Ryan Kusek - 9"},{"$f":"L36","v":44}]
[null,{"$f":"Q8","v":"Cameron Boyd - 11"},{"$f":"AA8","v":51}]
[null,{"$f":"Q9","v":"Alex Thompson - 9"},{"$f":"AA9","v":54}]
[null,{"$f":"Q10","v":"Collin Travis - 11"},{"$f":"AA10","v":39}]
[null,{"$f":"Q11","v":"Austin Douglas - 10"},{"$f":"AA11","v":42}]
[null,{"$f":"Q12","v":"Trevor  Reierson - 11"},{"$f":"AA12","v":53}]
[null,{"$f":"Q16","v":"Devon Hanson - 11"},{"$f":"AA16","v":42}]
[null,{"$f":"Q17","v":"Mitch Saari - 12"},{"$f":"AA17","v":45}]
[null,{"$f":"Q18","v":"Sam Struebing - 11"},{"$f":"AA18","v":50}]
[null,{"$f":"Q19","v":"Josh Breuer - 12"},{"$f":"AA19","v":48}]
[null,{"$f":"Q20","v":"Brad Halverson - 9"},{"$f":"AA20","v":48}]
[null,{"$f":"Q24","v":"Alex Haas - 12"},{"$f":"AA24","v":39}]
[null,{"$f":"Q25","v":"Max Rohlinger - 10"},{"$f":"AA25","v":43}]
[null,{"$f":"Q26","v":"Kevin Albrecht - 11"},{"$f":"AA26","v":42}]
[null,{"$f":"Q27","v":"Jacob Droese - 12"},{"$f":"AA27","v":42}]
[null,{"$f":"Q28","v":"Nick Meucci - 12"},{"$f":"AA28","v":44}]
[null,{"$f":"Q32","v":"Scratch #1 - x"},{"$f":"AA32","v":81}]
[null,{"$f":"Q33","v":"Scratch #2 - x"},{"$f":"AA33","v":81}]
[null,{"$f":"Q34","v":"Zachary Stahle - 12"},{"$f":"AA34","v":49}]
[null,{"$f":"Q35","v":"Ben Krause - 12"},{"$f":"AA35","v":46}]
[null,{"$f":"Q36","v":"Brendan Hausch - 10"},{"$f":"AA36","v":58}]

{"sheet":"SL","index":7,"n_rows":440,"n_cols":56,"rows_kept":440,"cut":false,"hidden":false,"merged":[[46,1,48,12],[40,16,40,26]]}
[null,"Course:   ","Washington County Golf Course"]
[null,"Hole   ",1,2,3,4,5,6,7,8,9,"Total",null,null,null,null,"Hole   ",{"$f":"C2","v":1},2,3,4,5,6,7,8,9,"Total"]
[null,"  Par   ",4,4,5,3,4,3,5,4,4,{"$f":"SUM(C3:K3)","v":36},null,null,null,null,"  Par   ",4,4,5,3,4,3,5,4,4,{"$f":"L3","v":36}]
[null,"Handicap  ",9,7,3,17,13,15,1,11,5,null,null,null,null,null,"Handicap  ",9,7,3,17,13,15,1,11,5]
[]
[]
["Player","BEAVER DAM",null,null,null,null,null,null,null,null,null,null,"Place",null,null,"Player","WATERTOWN",null,null,null,null,null,null,null,null,null,null,"Place"]
[1,"Koby Jones - 12",6,5,5,6,3,5,6,5,5,{"$f":"IF(COUNTBLANK(C8:K8)>0,\"\",SUM(C8:K8))","v":46},{"$f":"VLOOKUP(BA8,$B$301:$E$340,4)","v":24},null,null,1,"Cameron Boyd - 11",5,5,6,3,4,3,7,6,5,{"$f":"IF(COUNTBLANK(R8:Z8)>0,\"\",SUM(R8:Z8))","v":44},{"$f":"VLOOKUP(BB8,$B$301:$E$340,4)","v":20},null,null,null,null,null,null,null,null,null,null,null,null,null,null,null,null,null,null,null,null,null,null,null,null,1,21,{"$f":"LEN(L8)","v":2},{"$f":"LEN(AA8)","v":2}]
[2,"Thomas Bleich - 11",4,5,7,3,4,4,6,5,4,{"$f":"IF(COUNTBLANK(C9:K9)>0,\"\",SUM(C9:K9))","v":42},{"$f":"VLOOKUP(BA9,$B$301:$E$340,4)","v":13},null,null,2,"Alex Thompson - 9",6,6,6,4,5,3,6,5,6,{"$f":"IF(COUNTBLANK(R9:Z9)>0,\"\",SUM(R9:Z9))","v":47},{"$f":"VLOOKUP(BB9,$B$301:$E$340,4)","v":25},null,null,null,null,null,null,null,null,null,null,null,null,null,null,null,null,null,null,null,null,null,null,null,null,2,22,{"$f":"LEN(L9)","v":2},{"$f":"LEN(AA9)","v":2}]
[3,"Cody Trotter - 12",5,6,6,3,3,4,6,9,5,{"$f":"IF(COUNTBLANK(C10:K10)>0,\"\",SUM(C10:K10))","v":47},{"$f":"VLOOKUP(BA10,$B$301:$E$340,4)","v":25},null,null,3,"Collin Travis - 11",7,5,6,3,5,5,5,4,5,{"$f":"IF(COUNTBLANK(R10:Z10)>0,\"\",SUM(R10:Z10))","v":45},{"$f":"VLOOKUP(BB10,$B$301:$E$340,4)","v":22},null,null,null,null,null,null,null,null,null,null,null,null,null,null,null,null,null,null,null,null,null,null,null,null,3,23,{"$f":"LEN(L10)","v":2},{"$f":"LEN(AA10)","v":2}]
[4,"Jacob Smith - 10",4,4,5,3,6,3,8,5,5,{"$f":"IF(COUNTBLANK(C11:K11)>0,\"\",SUM(C11:K11))","v":43},{"$f":"VLOOKUP(BA11,$B$301:$E$340,4)","v":16},null,null,4,"Austin Douglas - 10",8,6,11,4,5,4,7,4,6,{"$f":"IF(COUNTBLANK(R11:Z11)>0,\"\",SUM(R11:Z11))","v":55},{"$f":"VLOOKUP(BB11,$B$301:$E$340,4)","v":37},null,null,null,null,null,null,null,null,null,null,null,null,null,null,null,null,null,null,null,null,null,null,null,null,4,24,{"$f":"LEN(L11)","v":2},{"$f":"LEN(AA11)","v":2}]
[5,"Carter Smith - 11",5,7,6,4,5,6,6,7,5,{"$f":"IF(COUNTBLANK(C12:K12)>0,\"\",SUM(C12:K12))","v":51},{"$f":"VLOOKUP(BA12,$B$301:$E$340,4)","v":34},null,null,5,"Trevor  Reierson - 11",6,5,5,4,4,5,8,6,7,{"$f":"IF(COUNTBLANK(R12:Z12)>0,\"\",SUM(R12:Z12))","v":50},{"$f":"VLOOKUP(BB12,$B$301:$E$340,4)","v":33},null,null,null,null,null,null,null,null,null,null,null,null,null,null,null,null,null,null,null,null,null,null,null,null,5,25,{"$f":"LEN(L12)","v":2},{"$f":"LEN(AA12)","v":2}]
[null,null,null,null,null,null,null,null,null,null,null,{"$f":"IF(COUNT(L8:L12)=5,(SUM(L8:L12))-(MAX(L8:L12)),(IF(COUNT(L8:L12)=4,SUM(L8:L12),IF(COUNTBLANK(L8:L12)>0,SUM(L8:L12),\"DQ\"))))","v":178},{"$f":"J351","v":6},null,null,null,null,null,null,null,null,null,null,null,null,null,{"$f":"IF(COUNT(AA8:AA12)=5,(SUM(AA8:AA12))-(MAX(AA8:AA12)),(IF(COUNT(AA8:AA12)=4,SUM(AA8:AA12),IF(COUNTBLANK(AA8:AA12)>0,SUM(AA8:AA12),\"DQ\"))))","v":186},{"$f":"J355","v":7}]
[null,null,null,null,null,null,null,null,null,null,null,{"$f":"IF(COUNT(L8:L12)=5,MAX(L8:L12),IF(COUNT(L8:L12)<5,200,))","v":51},null,null,null,null,null,null,null,null,null,null,null,null,null,null,{"$f":"IF(COUNT(AA8:AA12)=5,MAX(AA8:AA12),IF(COUNT(AA8:AA12)<5,200,))","v":55}]
["Player","HARTFORD",null,null,null,null,null,null,null,null,null,null,"Place",null,null,"Player","WEST BEND EAST",null,null,null,null,null,null,null,null,null,null,"Place"]
[1,"Ryan Ruona - 11",4,5,5,3,4,4,6,4,7,{"$f":"IF(COUNTBLANK(C16:K16)>0,\"\",SUM(C16:K16))","v":42},{"$f":"VLOOKUP(BA16,$B$301:$E$340,4)","v":13},null,null,1,"Devon Hanson - 11",4,3,5,4,4,4,5,4,5,{"$f":"IF(COUNTBLANK(R16:Z16)>0,\"\",SUM(R16:Z16))","v":38},{"$f":"VLOOKUP(BB16,$B$301:$E$340,4)","v":2},null,null,null,null,null,null,null,null,null,null,null,null,null,null,null,null,null,null,null,null,null,null,null,null,6,26,{"$f":"LEN(L16)","v":2},{"$f":"LEN(AA16)","v":2}]
[2,"Adam Butler - 12",4,5,5,3,6,4,6,5,5,{"$f":"IF(COUNTBLANK(C17:K17)>0,\"\",SUM(C17:K17))","v":43},{"$f":"VLOOKUP(BA17,$B$301:$E$340,4)","v":16},null,null,2,"Mitch Saari - 12",5,5,5,4,4,3,6,4,4,{"$f":"IF(COUNTBLANK(R17:Z17)>0,\"\",SUM(R17:Z17))","v":40},{"$f":"VLOOKUP(BB17,$B$301:$E$340,4)","v":6},null,null,null,null,null,null,null,null,null,null,null,null,null,null,null,null,null,null,null,null,null,null,null,null,7,27,{"$f":"LEN(L17)","v":2},{"$f":"LEN(AA17)","v":2}]
[3,"Luke Carroll - 10",6,5,7,3,5,5,6,5,5,{"$f":"IF(COUNTBLANK(C18:K18)>0,\"\",SUM(C18:K18))","v":47},{"$f":"VLOOKUP(BA18,$B$301:$E$340,4)","v":25},null,null,3,"Sam Struebing - 11",6,6,6,4,5,5,7,9,5,{"$f":"IF(COUNTBLANK(R18:Z18)>0,\"\",SUM(R18:Z18))","v":53},{"$f":"VLOOKUP(BB18,$B$301:$E$340,4)","v":35},null,null,null,null,null,null,null,null,null,null,null,null,null,null,null,null,null,null,null,null,null,null,null,null,8,28,{"$f":"LEN(L18)","v":2},{"$f":"LEN(AA18)","v":2}]
[4,"Lucas Hass - 11",5,4,6,4,4,4,6,5,6,{"$f":"IF(COUNTBLANK(C19:K19)>0,\"\",SUM(C19:K19))","v":44},{"$f":"VLOOKUP(BA19,$B$301:$E$340,4)","v":20},null,null,4,"Josh Breuer - 12",5,5,5,4,5,2,5,4,5,{"$f":"IF(COUNTBLANK(R19:Z19)>0,\"\",SUM(R19:Z19))","v":40},{"$f":"VLOOKUP(BB19,$B$301:$E$340,4)","v":6},null,null,null,null,null,null,null,null,null,null,null,null,null,null,null,null,null,null,null,null,null,null,null,null,9,29,{"$f":"LEN(L19)","v":2},{"$f":"LEN(AA19)","v":2}]
[5,"Mike Vanderheiden - 10",5,6,6,3,4,6,6,8,5,{"$f":"IF(COUNTBLANK(C20:K20)>0,\"\",SUM(C20:K20))","v":49},{"$f":"VLOOKUP(BA20,$B$301:$E$340,4)","v":31},null,null,5,"Brad Halverson - 9",6,6,5,4,4,5,6,6,6,{"$f":"IF(COUNTBLANK(R20:Z20)>0,\"\",SUM(R20:Z20))","v":48},{"$f":"VLOOKUP(BB20,$B$301:$E$340,4)","v":30},null,null,null,null,null,null,null,null,null,null,null,null,null,null,null,null,null,null,null,null,null,null,null,null,10,30,{"$f":"LEN(L20)","v":2},{"$f":"LEN(AA20)","v":2}]
[null,null,null,null,null,null,null,null,null,null,null,{"$f":"IF(COUNT(L16:L20)=5,(SUM(L16:L20))-(MAX(L16:L20)),(IF(COUNT(L16:L20)=4,SUM(L16:L20),IF(COUNTBLANK(L16:L20)>0,SUM(L16:L20),\"DQ\"))))","v":176},{"$f":"J352","v":5},null,null,null,null,null,null,null,null,null,null,null,null,null,{"$f":"IF(COUNT(AA16:AA20)=5,(SUM(AA16:AA20))-(MAX(AA16:AA20)),(IF(COUNT(AA16:AA20)=4,SUM(AA16:AA20),IF(COUNTBLANK(AA16:AA20)>0,SUM(AA16:AA20),\"DQ\"))))","v":166},{"$f":"J356","v":4}]
[null,null,null,null,null,null,null,null,null,null,null,{"$f":"IF(COUNT(L16:L20)=5,MAX(L16:L20),IF(COUNT(L16:L20)<5,200,))","v":49},null,null,null,null,null,null,null,null,null,null,null,null,null,null,{"$f":"IF(COUNT(AA16:AA20)=5,MAX(AA16:AA20),IF(COUNT(AA16:AA20)<5,200,))","v":53}]
["Player","OCONOMOWOC",null,null,null,null,null,null,null,null,null,null,"Place",null,null,"Player","WEST BEND WEST",null,null,null,null,null,null,null,null,null,null,"Place"]
[1,"George Kneiser - 11",4,5,4,3,4,4,5,5,5,{"$f":"IF(COUNTBLANK(C24:K24)>0,\"\",SUM(C24:K24))","v":39},{"$f":"VLOOKUP(BA24,$B$301:$E$340,4)","v":3},null,null,1,"Alex Haas - 12",5,4,6,3,4,4,5,7,5,{"$f":"IF(COUNTBLANK(R24:Z24)>0,\"\",SUM(R24:Z24))","v":43},{"$f":"VLOOKUP(BB24,$B$301:$E$340,4)","v":16},null,null,null,null,null,null,null,null,null,null,null,null,null,null,null,null,null,null,null,null,null,null,null,null,11,31,{"$f":"LEN(L24)","v":2},{"$f":"LEN(AA24)","v":2}]
[2,"Colin Prom - 12",5,4,5,3,4,4,6,4,5,{"$f":"IF(COUNTBLANK(C25:K25)>0,\"\",SUM(C25:K25))","v":40},{"$f":"VLOOKUP(BA25,$B$301:$E$340,4)","v":6},null,null,2,"Max Rohlinger - 10",5,4,6,2,4,4,6,5,4,{"$f":"IF(COUNTBLANK(R25:Z25)>0,\"\",SUM(R25:Z25))","v":40},{"$f":"VLOOKUP(BB25,$B$301:$E$340,4)","v":6},null,null,null,null,null,null,null,null,null,null,null,null,null,null,null,null,null,null,null,null,null,null,null,null,12,32,{"$f":"LEN(L25)","v":2},{"$f":"LEN(AA25)","v":2}]
[3,"Joey Ploch - 9",5,4,5,3,4,3,6,4,5,{"$f":"IF(COUNTBLANK(C26:K26)>0,\"\",SUM(C26:K26))","v":39},{"$f":"VLOOKUP(BA26,$B$301:$E$340,4)","v":3},null,null,3,"Kevin Albrecht - 11",4,4,5,3,4,3,5,5,6,{"$f":"IF(COUNTBLANK(R26:Z26)>0,\"\",SUM(R26:Z26))","v":39},{"$f":"VLOOKUP(BB26,$B$301:$E$340,4)","v":3},null,null,null,null,null,null,null,null,null,null,null,null,null,null,null,null,null,null,null,null,null,null,null,null,13,33,{"$f":"LEN(L26)","v":2},{"$f":"LEN(AA26)","v":2}]
[4,"Brett Lange - 12",5,4,5,4,3,5,5,5,5,{"$f":"IF(COUNTBLANK(C27:K27)>0,\"\",SUM(C27:K27))","v":41},{"$f":"VLOOKUP(BA27,$B$301:$E$340,4)","v":10},null,null,4,"Jacob Droese - 12",6,6,6,3,6,6,6,5,5,{"$f":"IF(COUNTBLANK(R27:Z27)>0,\"\",SUM(R27:Z27))","v":49},{"$f":"VLOOKUP(BB27,$B$301:$E$340,4)","v":31},null,null,null,null,null,null,null,null,null,null,null,null,null,null,null,null,null,null,null,null,null,null,null,null,14,34,{"$f":"LEN(L27)","v":2},{"$f":"LEN(AA27)","v":2}]
[5,"Drew Cook - 11",5,6,6,4,5,4,5,5,7,{"$f":"IF(COUNTBLANK(C28:K28)>0,\"\",SUM(C28:K28))","v":47},{"$f":"VLOOKUP(BA28,$B$301:$E$340,4)","v":25},null,null,5,"Nick Meucci - 12",5,5,5,3,4,3,5,5,6,{"$f":"IF(COUNTBLANK(R28:Z28)>0,\"\",SUM(R28:Z28))","v":41},{"$f":"VLOOKUP(BB28,$B$301:$E$340,4)","v":10},null,null,null,null,null,null,null,null,null,null,null,null,null,null,null,null,null,null,null,null,null,null,null,null,15,35,{"$f":"LEN(L28)","v":2},{"$f":"LEN(AA28)","v":2}]
[null,null,null,null,null,null,null,null,null,null,null,{"$f":"IF(COUNT(L24:L28)=5,(SUM(L24:L28))-(MAX(L24:L28)),(IF(COUNT(L24:L28)=4,SUM(L24:L28),IF(COUNTBLANK(L24:L28)>0,SUM(L24:L28),\"DQ\"))))","v":159},{"$f":"J353","v":1},null,null,null,null,null,null,null,null,null,null,null,null,null,{"$f":"IF(COUNT(AA24:AA28)=5,(SUM(AA24:AA28))-(MAX(AA24:AA28)),(IF(COUNT(AA24:AA28)=4,SUM(AA24:AA28),IF(COUNTBLANK(AA24:AA28)>0,SUM(AA24:AA28),\"DQ\"))))","v":163},{"$f":"J357","v":3}]
[null,null,null,null,null,null,null,null,null,null,null,{"$f":"IF(COUNT(L24:L28)=5,MAX(L24:L28),IF(COUNT(L24:L28)<5,200,))","v":47},null,null,null,null,null,null,null,null,null,null,null,null,null,null,{"$f":"IF(COUNT(AA24:AA28)=5,MAX(AA24:AA28),IF(COUNT(AA24:AA28)<5,200,))","v":49}]
["Player","SLINGER",null,null,null,null,null,null,null,null,null,null,"Place",null,null,"Player","WISCONSIN LUTHERAN",null,null,null,null,null,null,null,null,null,null,"Place"]
[1,"Jack Burns - 12",6,4,5,3,5,4,6,4,5,{"$f":"IF(COUNTBLANK(C32:K32)>0,\"\",SUM(C32:K32))","v":42},{"$f":"VLOOKUP(BA32,$B$301:$E$340,4)","v":13},null,null,1,"Scratch #1 - x",9,9,9,9,9,9,9,9,9,{"$f":"IF(COUNTBLANK(R32:Z32)>0,\"\",SUM(R32:Z32))","v":81},{"$f":"VLOOKUP(BB32,$B$301:$E$340,4)","v":38},null,null,null,null,null,null,null,null,null,null,null,null,null,null,null,null,null,null,null,null,null,null,null,null,16,36,{"$f":"LEN(L32)","v":2},{"$f":"LEN(AA32)","v":2}]
[2,"Chris Evans - 11",4,5,6,4,4,6,6,6,6,{"$f":"IF(COUNTBLANK(C33:K33)>0,\"\",SUM(C33:K33))","v":47},{"$f":"VLOOKUP(BA33,$B$301:$E$340,4)","v":25},null,null,2,"Scratch #2 - x",9,9,9,9,9,9,9,9,9,{"$f":"IF(COUNTBLANK(R33:Z33)>0,\"\",SUM(R33:Z33))","v":81},{"$f":"VLOOKUP(BB33,$B$301:$E$340,4)","v":38},null,null,null,null,null,null,null,null,null,null,null,null,null,null,null,null,null,null,null,null,null,null,null,null,17,37,{"$f":"LEN(L33)","v":2},{"$f":"LEN(AA33)","v":2}]
[3,"Austin Walsh - 12",5,4,5,4,4,3,5,3,4,{"$f":"IF(COUNTBLANK(C34:K34)>0,\"\",SUM(C34:K34))","v":37},{"$f":"VLOOKUP(BA34,$B$301:$E$340,4)","v":1},null,null,3,"Zachary Stahle - 12",5,6,6,3,4,3,7,6,5,{"$f":"IF(COUNTBLANK(R34:Z34)>0,\"\",SUM(R34:Z34))","v":45},{"$f":"VLOOKUP(BB34,$B$301:$E$340,4)","v":22},null,null,null,null,null,null,null,null,null,null,null,null,null,null,null,null,null,null,null,null,null,null,null,null,18,38,{"$f":"LEN(L34)","v":2},{"$f":"LEN(AA34)","v":2}]
[4,"Ryan Graunke - 12",6,6,5,2,4,3,5,5,5,{"$f":"IF(COUNTBLANK(C35:K35)>0,\"\",SUM(C35:K35))","v":41},{"$f":"VLOOKUP(BA35,$B$301:$E$340,4)","v":10},null,null,4,"Ben Krause - 12",6,5,5,4,8,5,11,4,5,{"$f":"IF(COUNTBLANK(R35:Z35)>0,\"\",SUM(R35:Z35))","v":53},{"$f":"VLOOKUP(BB35,$B$301:$E$340,4)","v":35},null,null,null,null,null,null,null,null,null,null,null,null,null,null,null,null,null,null,null,null,null,null,null,null,19,39,{"$f":"LEN(L35)","v":2},{"$f":"LEN(AA35)","v":2}]
[5,"Ryan Kusek - 9",5,5,6,4,4,4,6,5,4,{"$f":"IF(COUNTBLANK(C36:K36)>0,\"\",SUM(C36:K36))","v":43},{"$f":"VLOOKUP(BA36,$B$301:$E$340,4)","v":16},null,null,5,"Scratch #3 - x",9,9,9,9,9,9,9,9,9,{"$f":"IF(COUNTBLANK(R36:Z36)>0,\"\",SUM(R36:Z36))","v":81},{"$f":"VLOOKUP(BB36,$B$301:$E$340,4)","v":38},null,null,null,null,null,null,null,null,null,null,null,null,null,null,null,null,null,null,null,null,null,null,null,null,20,40,{"$f":"LEN(L36)","v":2},{"$f":"LEN(AA36)","v":2}]
[null,null,null,null,null,null,null,null,null,null,null,{"$f":"IF(COUNT(L32:L36)=5,(SUM(L32:L36))-(MAX(L32:L36)),(IF(COUNT(L32:L36)=4,SUM(L32:L36),IF(COUNTBLANK(L32:L36)>0,SUM(L32:L36),\"DQ\"))))","v":163},{"$f":"J354","v":2},null,null,null,null,null,null,null,null,null,null,null,null,null,{"$f":"IF(COUNT(AA32:AA36)=5,(SUM(AA32:AA36))-(MAX(AA32:AA36)),(IF(COUNT(AA32:AA36)=4,SUM(AA32:AA36),IF(COUNTBLANK(AA32:AA36)>0,SUM(AA32:AA36),\"DQ\"))))","v":260},{"$f":"J358","v":8}]
[null,null,null,null,null,null,null,null,null,null,null,{"$f":"IF(COUNT(L32:L36)=5,MAX(L32:L36),IF(COUNT(L32:L36)<5,200,))","v":47},null,null,null,null,null,null,null,null,null,null,null,null,null,null,{"$f":"IF(COUNT(AA32:AA36)=5,MAX(AA32:AA36),IF(COUNT(AA32:AA36)<5,200,))","v":81}]
[]
[]
[null,"Wisconsin Little Ten Varsity Golf",null,null,null,null,"Match # 8",null,null,null,null,"Hosted By: ","Slinger",null,null,null,{"$f":"\"WISCONSIN LITTLE TEN CONFERENCE STANDINGS \" & Schedule!Q41","v":"WISCONSIN LITTLE TEN CONFERENCE STANDINGS "}]
[null,null,null,null,null,null,null,null,null,null,null,null,null,null,null,null,"Match  ","1",2,3,4,5,6,7,8,9,"Total"]
[null,"Date: May 13, 2015",null,{"$f":"\"Location: \" & C1","v":"Location: Washington County Golf Course"},null,null,null,null,null,null,null,null,null,null,null,null,{"$f":"Rosters!$B$10","v":"West Bend West"},1,1,2,2,5,1,1,3,null,{"$f":"IF(SUM(R43:Z43)=0,\"\",SUM(R43:Z43))","v":16}]
[null,"Weather: 55, light breeze, sunny",null,null,null,null,null,null,null,null,null,null,null,null,null,null,{"$f":"Rosters!$B$6","v":"Oconomowoc"},2,3,3,1,3,3,3,1,null,19]
[null,null,null,null,null,null,null,null,null,null,null,null,null,null,null,null,{"$f":"Rosters!$B$7","v":"Slinger"},4,6,1,3,2,4,4,2,null,26]
[null,null,null,null,null,null,null,null,null,null,null,null,null,null,null,null,{"$f":"Rosters!$B$4","v":"Beaver Dam"},3,2,4,6,1,2,2,6,null,26]
[null,"Medalist: (37) - Austin Walsh",null,null,null,null,null,null,null,null,null,null,null,null,null,null,{"$f":"Rosters!$B$9","v":"West Bend East"},5,4,6,5,4,5,6,4,null,39]
[null,null,null,null,null,null,null,null,null,null,null,null,null,null,null,null,{"$f":"Rosters!$B$5","v":"Hartford"},6,5,5,4,6,6,5,5,null,42]
[null,null,null,null,null,null,null,null,null,null,null,null,null,null,null,null,{"$f":"Rosters!$B$8","v":"Watertown"},7,7,7,7,7,7,7,7,null,56]
[null,null,null,null,null,null,null,null,null,null,null,"= Birdies or Better",null,null,null,null,{"$f":"Rosters!$B$11","v":"Wisconsin Lutheran"},8,8,8,8,8,8,8,8,null,64]
[]
[]
[]
[]
[]
[]
[]
[]
[]
[]
[]
[]
[]
[]
[]
[]
[]
[]
[]
[]
[]
[]
[]
[]
[]
[]
[]
[]
[]
[]
[]
[]
[]
[]
[]
[]
[]
[]
[]
[]
[]
[]
[]
[]
[]
[]
[]
[]
[]
[null,"Course:   ","Washington County Golf Course"]
[null,"Hole   ",1,2,3,4,5,6,7,8,9,"Total"]
[null,"  Par   ",4,4,5,3,4,3,5,4,4,{"$f":"SUM(C102:K102)","v":36}]
[null,"Handicap  ",9,7,3,17,13,15,1,11,5]
[]
[null,"Course:   ","Washington County Golf Course"]
[null,"Hole   ",10,11,12,13,14,15,16,17,18,"Total"]
[null,"  Par   ",4,4,4,5,3,4,3,5,4,{"$f":"SUM(C107:K107)","v":36}]
[null,"Handicap  ",12,14,8,4,18,10,16,2,6]
[]
[]
[]
[]
[]
[]
[]
[]
[]
[]
[]
[]
[]
[]
[]
[]
[]
[]
[]
[]
[]
[]
[]
[]
[]
[]
[]
[]
[]
[]
[]
[]
[]
[]
[]
[]
[]
[]
[]
[]
[]
[]
[]
[]
[]
[]
[]
[]
[]
[]
[]
[]
[]
[]
[]
[]
[]
[]
[]
[]
[]
[]
[]
[]
[]
[]
[]
[]
[]
[]
[]
[]
[]
[]
[]
[]
[]
[]
[]
[]
[]
[]
[]
[]
[]
[]
[]
[]
[]
[]
[]
[]
[]
[]
[]
[]
[]
[]
[]
[]
[]
[]
[]
[]
[]
[]
[]
[]
[]
[]
[]
[]
[]
[]
[]
[]
[]
[]
[]
[]
[]
[]
[]
[]
[]
[]
[]
[]
[]
[]
[]
[]
[]
[]
[]
[]
[]
[]
[]
[]
[]
[]
[]
[]
[]
[]
[]
[]
[]
[]
[]
[]
[]
[]
[]
[]
[]
[]
[]
[]
[]
[]
[]
[]
[]
[]
[]
[]
[]
[]
[]
[]
[]
[]
[]
[]
[]
[]
[]
[]
[]
[]
[]
[]
[]
[]
[]
[]
[]
[]
[]
[null,"Player","Sc","Sort","Rnk"]
[null,1,{"$f":"$L$8","v":46},null,24]
[null,2,{"$f":"$L$9","v":42},null,13]
[null,3,{"$f":"$L$10","v":47},null,25]
[null,4,{"$f":"$L$11","v":43},null,16]
[null,5,{"$f":"$L$12","v":51},null,34]
[null,6,{"$f":"$L$16","v":42},null,13]
[null,7,{"$f":"$L$17","v":43},null,16]
[null,8,{"$f":"$L$18","v":47},null,25]
[null,9,{"$f":"$L$19","v":44},null,20]
[null,10,{"$f":"$L$20","v":49},null,31]
[null,11,{"$f":"$L$24","v":39},null,3]
[null,12,{"$f":"$L$25","v":40},null,6]
[null,13,{"$f":"$L$26","v":39},null,3]
[null,14,{"$f":"$L$27","v":41},null,10]
[null,15,{"$f":"$L$28","v":47},null,25]
[null,16,{"$f":"$L$32","v":42},null,13]
[null,17,{"$f":"$L$33","v":47},null,25]
[null,18,{"$f":"$L$34","v":37},null,1]
[null,19,{"$f":"$L$35","v":41},null,10]
[null,20,{"$f":"$L$36","v":43},null,16]
[null,21,{"$f":"$AA$8","v":44},null,20]
[null,22,{"$f":"$AA$9","v":47},null,25]
[null,23,{"$f":"$AA$10","v":45},null,22]
[null,24,{"$f":"$AA$11","v":55},null,37]
[null,25,{"$f":"$AA$12","v":50},null,33]
[null,26,{"$f":"$AA$16","v":38},null,2]
[null,27,{"$f":"$AA$17","v":40},null,6]
[null,28,{"$f":"$AA$18","v":53},null,35]
[null,29,{"$f":"$AA$19","v":40},null,6]
[null,30,{"$f":"$AA$20","v":48},null,30]
[null,31,{"$f":"$AA$24","v":43},null,16]
[null,32,{"$f":"$AA$25","v":40},null,6]
[null,33,{"$f":"$AA$26","v":39},null,3]
[null,34,{"$f":"$AA$27","v":49},null,31]
[null,35,{"$f":"$AA$28","v":41},null,10]
[null,36,{"$f":"$AA$32","v":81},null,38]
[null,37,{"$f":"$AA$33","v":81},null,38]
[null,38,{"$f":"$AA$34","v":45},null,22]
[null,39,{"$f":"$AA$35","v":53},null,35]
[null,40,{"$f":"$AA$36","v":81},null,38]
[null,{"$f":"B69","v":0}]
[null,{"$f":"B70","v":0}]
[null,{"$f":"B71","v":0}]
[]
[]
[]
[]
[]
[]
[null,null,1,2,3,4,5,"Mx","Tot",1]
[null,"Team1",{"$f":"$L$8","v":46},{"$f":"$L$9","v":42},{"$f":"$L$10","v":47},{"$f":"$L$11","v":43},{"$f":"$L$12","v":51},{"$f":"$L$14","v":51},{"$f":"$L$13","v":178},6,null,6,null,null,null,null,null,0,0,0,0,0,0,0,0,0]
[null,"Team2",{"$f":"$L$16","v":42},{"$f":"$L$17","v":43},{"$f":"$L$18","v":47},{"$f":"$L$19","v":44},{"$f":"$L$20","v":49},{"$f":"$L$22","v":49},{"$f":"$L$21","v":176},5,null,5,null,null,null,null,null,0,0,0,0,0,0,0,0,0]
[null,"Team3",{"$f":"$L$24","v":39},{"$f":"$L$25","v":40},{"$f":"$L$26","v":39},{"$f":"$L$27","v":41},{"$f":"$L$28","v":47},{"$f":"$L$30","v":47},{"$f":"$L$29","v":159},1,null,1,null,null,null,null,null,0,0,0,0,0,0,0,0,0]
[null,"Team4",{"$f":"$L$32","v":42},{"$f":"$L$33","v":47},{"$f":"$L$34","v":37},{"$f":"$L$35","v":41},{"$f":"$L$36","v":43},{"$f":"$L$38","v":47},{"$f":"$L$37","v":163},2,null,2,null,null,null,null,null,0,0,0,0,0,0,0,0,0]
[null,"Team5",{"$f":"$AA$8","v":44},{"$f":"$AA$9","v":47},{"$f":"$AA$10","v":45},{"$f":"$AA$11","v":55},{"$f":"$AA$12","v":50},{"$f":"$AA$14","v":55},{"$f":"$AA$13","v":186},7,null,7,null,null,null,null,null,0,0,0,0,0,0,0,0,0]
[null,"Team6",{"$f":"$AA$16","v":38},{"$f":"$AA$17","v":40},{"$f":"$AA$18","v":53},{"$f":"$AA$19","v":40},{"$f":"$AA$20","v":48},{"$f":"$AA$22","v":53},{"$f":"$AA$21","v":166},4,null,4,null,null,null,null,null,0,0,0,0,0,0,0,0,0]
[null,"Team7",{"$f":"$AA$24","v":43},{"$f":"$AA$25","v":40},{"$f":"$AA$26","v":39},{"$f":"$AA$27","v":49},{"$f":"$AA$28","v":41},{"$f":"$AA$30","v":49},{"$f":"$AA$29","v":163},3,null,3,null,null,null,null,null,0,0,0,0,0,0,0,0,0]
[null,"Team8",{"$f":"$AA$32","v":81},{"$f":"$AA$33","v":81},{"$f":"$AA$34","v":45},{"$f":"$AA$35","v":53},{"$f":"$AA$36","v":81},{"$f":"$AA$38","v":81},{"$f":"$AA$37","v":260},8,null,8,null,null,null,null,null,0,0,0,0,0,0,0,0,0]
[]
[]
[]
[]
[]
[]
[]
[]
[]
[]
[]
[]
[]
[]
[]
[]
[]
[]
[]
[]
[]
[]
[]
[]
[]
[]
[]
[]
[]
[]
[]
[]
[]
[]
[]
[]
[]
[]
[]
[]
[]
[]
[null,{"$f":"B8","v":"Koby Jones - 12"},{"$f":"L8","v":46}]
[null,{"$f":"B9","v":"Thomas Bleich - 11"},{"$f":"L9","v":42}]
[null,{"$f":"B10","v":"Cody Trotter - 12"},{"$f":"L10","v":47}]
[null,{"$f":"B11","v":"Jacob Smith - 10"},{"$f":"L11","v":43}]
[null,{"$f":"B12","v":"Carter Smith - 11"},{"$f":"L12","v":51}]
[null,{"$f":"B16","v":"Ryan Ruona - 11"},{"$f":"L16","v":42}]
[null,{"$f":"B17","v":"Adam Butler - 12"},{"$f":"L17","v":43}]
[null,{"$f":"B18","v":"Luke Carroll - 10"},{"$f":"L18","v":47}]
[null,{"$f":"B19","v":"Lucas Hass - 11"},{"$f":"L19","v":44}]
[null,{"$f":"B20","v":"Mike Vanderheiden - 10"},{"$f":"L20","v":49}]
[null,{"$f":"B24","v":"George Kneiser - 11"},{"$f":"L24","v":39}]
[null,{"$f":"B25","v":"Colin Prom - 12"},{"$f":"L25","v":40}]
[null,{"$f":"B26","v":"Joey Ploch - 9"},{"$f":"L26","v":39}]
[null,{"$f":"B27","v":"Brett Lange - 12"},{"$f":"L27","v":41}]
[null,{"$f":"B28","v":"Drew Cook - 11"},{"$f":"L28","v":47}]
[null,{"$f":"B32","v":"Jack Burns - 12"},{"$f":"L32","v":42}]
[null,{"$f":"B33","v":"Chris Evans - 11"},{"$f":"L33","v":47}]
[null,{"$f":"B34","v":"Austin Walsh - 12"},{"$f":"L34","v":37}]
[null,{"$f":"B35","v":"Ryan Graunke - 12"},{"$f":"L35","v":41}]
[null,{"$f":"B36","v":"Ryan Kusek - 9"},{"$f":"L36","v":43}]
[null,{"$f":"Q8","v":"Cameron Boyd - 11"},{"$f":"AA8","v":44}]
[null,{"$f":"Q9","v":"Alex Thompson - 9"},{"$f":"AA9","v":47}]
[null,{"$f":"Q10","v":"Collin Travis - 11"},{"$f":"AA10","v":45}]
[null,{"$f":"Q11","v":"Austin Douglas - 10"},{"$f":"AA11","v":55}]
[null,{"$f":"Q12","v":"Trevor  Reierson - 11"},{"$f":"AA12","v":50}]
[null,{"$f":"Q16","v":"Devon Hanson - 11"},{"$f":"AA16","v":38}]
[null,{"$f":"Q17","v":"Mitch Saari - 12"},{"$f":"AA17","v":40}]
[null,{"$f":"Q18","v":"Sam Struebing - 11"},{"$f":"AA18","v":53}]
[null,{"$f":"Q19","v":"Josh Breuer - 12"},{"$f":"AA19","v":40}]
[null,{"$f":"Q20","v":"Brad Halverson - 9"},{"$f":"AA20","v":48}]
[null,{"$f":"Q24","v":"Alex Haas - 12"},{"$f":"AA24","v":43}]
[null,{"$f":"Q25","v":"Max Rohlinger - 10"},{"$f":"AA25","v":40}]
[null,{"$f":"Q26","v":"Kevin Albrecht - 11"},{"$f":"AA26","v":39}]
[null,{"$f":"Q27","v":"Jacob Droese - 12"},{"$f":"AA27","v":49}]
[null,{"$f":"Q28","v":"Nick Meucci - 12"},{"$f":"AA28","v":41}]
[null,{"$f":"Q32","v":"Scratch #1 - x"},{"$f":"AA32","v":81}]
[null,{"$f":"Q33","v":"Scratch #2 - x"},{"$f":"AA33","v":81}]
[null,{"$f":"Q34","v":"Zachary Stahle - 12"},{"$f":"AA34","v":45}]
[null,{"$f":"Q35","v":"Ben Krause - 12"},{"$f":"AA35","v":53}]
[null,{"$f":"Q36","v":"Scratch #3 - x"},{"$f":"AA36","v":81}]

{"sheet":"Conf","index":8,"n_rows":440,"n_cols":27,"rows_kept":440,"cut":false,"hidden":false,"merged":[[0,2,0,19],[69,1,70,22],[109,2,109,19],[114,2,114,19]]}
[null,"Course   ","Horicon Hills Golf Club"]
[null,"Hole   ",1,2,3,4,5,6,7,8,9,10,11,12,13,14,15,16,17,18,null,"Front","Back","Total","Place"]
[null,"  Par   ",4,4,3,4,4,3,5,4,4,4,4,4,3,4,4,3,4,5,null,{"$f":"SUM(C3:K3)","v":35},{"$f":"SUM(L3:T3)","v":35},{"$f":"SUM(C3:T3)","v":70}]
[null,"Handicap  ",6,14,18,10,4,16,2,8,12,11,9,13,15,5,7,17,1,3]
[]
[]
[null,"BEAVER DAM"]
[null,"Koby Jones - 12",6,4,3,4,5,4,6,4,5,4,4,4,4,5,6,3,5,5,null,{"$f":"IF(COUNTBLANK(C8:K8)>0,\"\",SUM(C8:K8))","v":41},{"$f":"IF(COUNTBLANK(L8:T8)>0,\"\",SUM(L8:T8))","v":40},{"$f":"IF(COUNTBLANK(V8:W8)>0,\"\",SUM(V8:W8))","v":81},{"$f":"VLOOKUP(AA8,$B$301:$E$340,4)","v":6},{"$f":"LEN(X8)","v":2},1]
[null,"Thomas Bleich - 11",5,4,4,7,5,5,7,4,5,6,4,5,3,5,6,3,5,6,null,{"$f":"IF(COUNTBLANK(C9:K9)>0,\"\",SUM(C9:K9))","v":46},{"$f":"IF(COUNTBLANK(L9:T9)>0,\"\",SUM(L9:T9))","v":43},{"$f":"IF(COUNTBLANK(V9:W9)>0,\"\",SUM(V9:W9))","v":89},{"$f":"VLOOKUP(AA9,$B$301:$E$340,4)","v":18},{"$f":"LEN(X9)","v":2},2]
[null,"Cody Trotter - 12",6,5,5,5,4,4,5,5,7,5,15,5,6,5,6,4,4,7,null,{"$f":"IF(COUNTBLANK(C10:K10)>0,\"\",SUM(C10:K10))","v":46},{"$f":"IF(COUNTBLANK(L10:T10)>0,\"\",SUM(L10:T10))","v":57},{"$f":"IF(COUNTBLANK(V10:W10)>0,\"\",SUM(V10:W10))","v":103},{"$f":"VLOOKUP(AA10,$B$301:$E$340,4)","v":36},{"$f":"LEN(X10)","v":3},3]
[null,"Jacob Smith - 10",6,5,4,6,6,5,6,5,4,5,5,5,5,6,6,6,6,7,null,{"$f":"IF(COUNTBLANK(C11:K11)>0,\"\",SUM(C11:K11))","v":47},{"$f":"IF(COUNTBLANK(L11:T11)>0,\"\",SUM(L11:T11))","v":51},{"$f":"IF(COUNTBLANK(V11:W11)>0,\"\",SUM(V11:W11))","v":98},{"$f":"VLOOKUP(AA11,$B$301:$E$340,4)","v":32},{"$f":"LEN(X11)","v":2},4]
[null,"Carter Smith - 11",5,4,4,4,5,4,5,6,4,6,6,5,3,5,8,5,7,6,null,{"$f":"IF(COUNTBLANK(C12:K12)>0,\"\",SUM(C12:K12))","v":41},{"$f":"IF(COUNTBLANK(L12:T12)>0,\"\",SUM(L12:T12))","v":51},{"$f":"IF(COUNTBLANK(V12:W12)>0,\"\",SUM(V12:W12))","v":92},{"$f":"VLOOKUP(AA12,$B$301:$E$340,4)","v":24},{"$f":"LEN(X12)","v":2},5]
[null,null,null,null,null,null,null,null,null,null,null,null,null,null,null,null,null,null,null,null,null,null,null,{"$f":"IF(COUNT(X8:X12)=5,(SUM(X8:X12))-(MAX(X8:X12)),(IF(COUNT(X8:X12)=4,SUM(X8:X12),IF(COUNTBLANK(X8:X12)>0,SUM(X8:X12),\"DQ\"))))","v":360},{"$f":"J351","v":6},null,101]
[null,null,null,null,null,null,null,null,null,null,null,null,null,null,null,null,null,null,null,null,null,null,null,{"$f":"IF(COUNT(X8:X12)=5,MAX(X8:X12),IF(COUNT(X8:X12)<5,500,))","v":103}]
[null,"HARTFORD"]
[null,"Ryan Ruona - 11",5,4,3,5,4,3,6,3,5,4,5,4,3,5,5,4,4,7,null,{"$f":"IF(COUNTBLANK(C16:K16)>0,\"\",SUM(C16:K16))","v":38},{"$f":"IF(COUNTBLANK(L16:T16)>0,\"\",SUM(L16:T16))","v":41},{"$f":"IF(COUNTBLANK(V16:W16)>0,\"\",SUM(V16:W16))","v":79},{"$f":"VLOOKUP(AA16,$B$301:$E$340,4)","v":4},{"$f":"LEN(X16)","v":2},6]
[null,"Adam Butler - 12",4,5,3,5,5,4,5,4,5,5,5,6,4,5,7,9,5,6,null,{"$f":"IF(COUNTBLANK(C17:K17)>0,\"\",SUM(C17:K17))","v":40},{"$f":"IF(COUNTBLANK(L17:T17)>0,\"\",SUM(L17:T17))","v":52},{"$f":"IF(COUNTBLANK(V17:W17)>0,\"\",SUM(V17:W17))","v":92},{"$f":"VLOOKUP(AA17,$B$301:$E$340,4)","v":24},{"$f":"LEN(X17)","v":2},7]
[null,"Luke Carroll - 10",5,6,3,5,4,4,5,5,5,4,5,4,4,4,7,4,4,4,null,{"$f":"IF(COUNTBLANK(C18:K18)>0,\"\",SUM(C18:K18))","v":42},{"$f":"IF(COUNTBLANK(L18:T18)>0,\"\",SUM(L18:T18))","v":40},{"$f":"IF(COUNTBLANK(V18:W18)>0,\"\",SUM(V18:W18))","v":82},{"$f":"VLOOKUP(AA18,$B$301:$E$340,4)","v":7},{"$f":"LEN(X18)","v":2},8]
[null,"Lucas Hass - 11",5,8,4,4,5,6,5,5,4,4,5,4,3,5,6,5,5,6,null,{"$f":"IF(COUNTBLANK(C19:K19)>0,\"\",SUM(C19:K19))","v":46},{"$f":"IF(COUNTBLANK(L19:T19)>0,\"\",SUM(L19:T19))","v":43},{"$f":"IF(COUNTBLANK(V19:W19)>0,\"\",SUM(V19:W19))","v":89},{"$f":"VLOOKUP(AA19,$B$301:$E$340,4)","v":18},{"$f":"LEN(X19)","v":2},9]
[null,"Zak Brooks - 10",5,5,4,5,11,6,8,7,7,6,7,5,6,4,6,5,5,5,null,{"$f":"IF(COUNTBLANK(C20:K20)>0,\"\",SUM(C20:K20))","v":58},{"$f":"IF(COUNTBLANK(L20:T20)>0,\"\",SUM(L20:T20))","v":49},{"$f":"IF(COUNTBLANK(V20:W20)>0,\"\",SUM(V20:W20))","v":107},{"$f":"VLOOKUP(AA20,$B$301:$E$340,4)","v":18},{"$f":"LEN(X20)","v":3},10]
[null,null,null,null,null,null,null,null,null,null,null,null,null,null,null,null,null,null,null,null,null,null,null,{"$f":"IF(COUNT(X16:X20)=5,(SUM(X16:X20))-(MAX(X16:X20)),(IF(COUNT(X16:X20)=4,SUM(X16:X20),IF(COUNTBLANK(X16:X20)>0,SUM(X16:X20),\"DQ\"))))","v":342},{"$f":"J352","v":4},null,102]
[null,null,null,null,null,null,null,null,null,null,null,null,null,null,null,null,null,null,null,null,null,null,null,{"$f":"IF(COUNT(X16:X20)=5,MAX(X16:X20),IF(COUNT(X16:X20)<5,500,))","v":107}]
[null,"OCONOMOWOC"]
[null,"George Kneiser - 11",5,3,3,4,4,4,5,5,4,4,6,6,3,4,6,3,5,8,null,{"$f":"IF(COUNTBLANK(C24:K24)>0,\"\",SUM(C24:K24))","v":37},{"$f":"IF(COUNTBLANK(L24:T24)>0,\"\",SUM(L24:T24))","v":45},{"$f":"IF(COUNTBLANK(V24:W24)>0,\"\",SUM(V24:W24))","v":82},{"$f":"VLOOKUP(AA24,$B$301:$E$340,4)","v":7},{"$f":"LEN(X24)","v":2},11]
[null,"Colin Prom - 12",4,4,5,4,5,5,4,5,5,5,5,5,4,3,5,5,5,4,null,{"$f":"IF(COUNTBLANK(C25:K25)>0,\"\",SUM(C25:K25))","v":41},{"$f":"IF(COUNTBLANK(L25:T25)>0,\"\",SUM(L25:T25))","v":41},{"$f":"IF(COUNTBLANK(V25:W25)>0,\"\",SUM(V25:W25))","v":82},{"$f":"VLOOKUP(AA25,$B$301:$E$340,4)","v":7},{"$f":"LEN(X25)","v":2},12]
[null,"Joey Ploch - 9",6,3,4,4,5,4,7,4,4,4,4,3,4,4,4,4,4,6,null,{"$f":"IF(COUNTBLANK(C26:K26)>0,\"\",SUM(C26:K26))","v":41},{"$f":"IF(COUNTBLANK(L26:T26)>0,\"\",SUM(L26:T26))","v":37},{"$f":"IF(COUNTBLANK(V26:W26)>0,\"\",SUM(V26:W26))","v":78},{"$f":"VLOOKUP(AA26,$B$301:$E$340,4)","v":3},{"$f":"LEN(X26)","v":2},13]
[null,"Brett Lange - 12",4,4,3,5,4,4,5,4,4,5,5,5,4,4,5,6,6,8,9,{"$f":"IF(COUNTBLANK(C27:K27)>0,\"\",SUM(C27:K27))","v":37},{"$f":"IF(COUNTBLANK(L27:T27)>0,\"\",SUM(L27:T27))","v":48},{"$f":"IF(COUNTBLANK(V27:W27)>0,\"\",SUM(V27:W27))","v":85},{"$f":"VLOOKUP(AA27,$B$301:$E$340,4)","v":13},{"$f":"LEN(X27)","v":2},14]
[null,"Allan Moutvic - 12",5,6,5,5,5,5,8,7,4,5,6,5,4,5,5,3,5,5,null,{"$f":"IF(COUNTBLANK(C28:K28)>0,\"\",SUM(C28:K28))","v":50},{"$f":"IF(COUNTBLANK(L28:T28)>0,\"\",SUM(L28:T28))","v":43},{"$f":"IF(COUNTBLANK(V28:W28)>0,\"\",SUM(V28:W28))","v":93},{"$f":"VLOOKUP(AA28,$B$301:$E$340,4)","v":27},{"$f":"LEN(X28)","v":2},15]
[null,null,null,null,null,null,null,null,null,null,null,null,null,null,null,null,null,null,null,null,null,null,null,{"$f":"IF(COUNT(X24:X28)=5,(SUM(X24:X28))-(MAX(X24:X28)),(IF(COUNT(X24:X28)=4,SUM(X24:X28),IF(COUNTBLANK(X24:X28)>0,SUM(X24:X28),\"DQ\"))))","v":327},{"$f":"J353","v":1},null,103]
[null,null,null,null,null,null,null,null,null,null,null,null,null,null,null,null,null,null,null,null,null,null,null,{"$f":"IF(COUNT(X24:X28)=5,MAX(X24:X28),IF(COUNT(X24:X28)<5,500,))","v":93}]
[null,"SLINGER"]
[null,"Jack Burns - 12",4,5,3,5,6,4,9,4,5,4,4,5,4,4,5,3,4,5,null,{"$f":"IF(COUNTBLANK(C32:K32)>0,\"\",SUM(C32:K32))","v":45},{"$f":"IF(COUNTBLANK(L32:T32)>0,\"\",SUM(L32:T32))","v":38},{"$f":"IF(COUNTBLANK(V32:W32)>0,\"\",SUM(V32:W32))","v":83},{"$f":"VLOOKUP(AA32,$B$301:$E$340,4)","v":10},{"$f":"LEN(X32)","v":2},16]
[null,"Chris Evans - 11",5,5,4,4,5,5,6,4,4,4,5,5,3,8,7,4,6,7,null,{"$f":"IF(COUNTBLANK(C33:K33)>0,\"\",SUM(C33:K33))","v":42},{"$f":"IF(COUNTBLANK(L33:T33)>0,\"\",SUM(L33:T33))","v":49},{"$f":"IF(COUNTBLANK(V33:W33)>0,\"\",SUM(V33:W33))","v":91},{"$f":"VLOOKUP(AA33,$B$301:$E$340,4)","v":21},{"$f":"LEN(X33)","v":2},17]
[null,"Austin Walsh - 12",4,5,3,5,4,4,5,4,4,6,4,3,4,4,4,4,6,7,null,{"$f":"IF(COUNTBLANK(C34:K34)>0,\"\",SUM(C34:K34))","v":38},{"$f":"IF(COUNTBLANK(L34:T34)>0,\"\",SUM(L34:T34))","v":42},{"$f":"IF(COUNTBLANK(V34:W34)>0,\"\",SUM(V34:W34))","v":80},{"$f":"VLOOKUP(AA34,$B$301:$E$340,4)","v":5},{"$f":"LEN(X34)","v":2},18]
[null,"Ryan Graunke - 12",6,5,3,6,5,4,6,4,5,4,5,4,4,4,6,4,5,7,null,{"$f":"IF(COUNTBLANK(C35:K35)>0,\"\",SUM(C35:K35))","v":44},{"$f":"IF(COUNTBLANK(L35:T35)>0,\"\",SUM(L35:T35))","v":43},{"$f":"IF(COUNTBLANK(V35:W35)>0,\"\",SUM(V35:W35))","v":87},{"$f":"VLOOKUP(AA35,$B$301:$E$340,4)","v":15},{"$f":"LEN(X35)","v":2},19]
[null,"Ryan Kusek - 9",4,6,3,5,5,4,5,4,5,6,4,5,3,6,5,4,6,6,null,{"$f":"IF(COUNTBLANK(C36:K36)>0,\"\",SUM(C36:K36))","v":41},{"$f":"IF(COUNTBLANK(L36:T36)>0,\"\",SUM(L36:T36))","v":45},{"$f":"IF(COUNTBLANK(V36:W36)>0,\"\",SUM(V36:W36))","v":86},{"$f":"VLOOKUP(AA36,$B$301:$E$340,4)","v":14},{"$f":"LEN(X36)","v":2},20]
[null,null,null,null,null,null,null,null,null,null,null,null,null,null,null,null,null,null,null,null,null,null,null,{"$f":"IF(COUNT(X32:X36)=5,(SUM(X32:X36))-(MAX(X32:X36)),(IF(COUNT(X32:X36)=4,SUM(X32:X36),IF(COUNTBLANK(X32:X36)>0,SUM(X32:X36),\"DQ\"))))","v":336},{"$f":"J354","v":3},null,104]
[null,null,null,null,null,null,null,null,null,null,null,null,null,null,null,null,null,null,null,null,null,null,null,{"$f":"IF(COUNT(X32:X36)=5,MAX(X32:X36),IF(COUNT(X32:X36)<5,500,))","v":91}]
[null,"WATERTOWN"]
[null,"Cameron Boyd - 11",5,5,4,5,6,4,6,5,6,5,4,5,4,5,4,4,4,6,null,{"$f":"IF(COUNTBLANK(C40:K40)>0,\"\",SUM(C40:K40))","v":46},{"$f":"IF(COUNTBLANK(L40:T40)>0,\"\",SUM(L40:T40))","v":41},{"$f":"IF(COUNTBLANK(V40:W40)>0,\"\",SUM(V40:W40))","v":87},{"$f":"VLOOKUP(AA40,$B$301:$E$340,4)","v":15},{"$f":"LEN(X40)","v":2},21]
[null,"Alex Thompson - 9",5,5,3,3,5,4,6,4,5,7,6,7,6,5,4,4,6,7,null,{"$f":"IF(COUNTBLANK(C41:K41)>0,\"\",SUM(C41:K41))","v":40},{"$f":"IF(COUNTBLANK(L41:T41)>0,\"\",SUM(L41:T41))","v":52},{"$f":"IF(COUNTBLANK(V41:W41)>0,\"\",SUM(V41:W41))","v":92},{"$f":"VLOOKUP(AA41,$B$301:$E$340,4)","v":36},{"$f":"LEN(X41)","v":2},22]
[null,"Collin Travis - 11",5,5,5,6,5,4,4,7,5,5,6,5,5,6,4,4,6,6,null,{"$f":"IF(COUNTBLANK(C42:K42)>0,\"\",SUM(C42:K42))","v":46},{"$f":"IF(COUNTBLANK(L42:T42)>0,\"\",SUM(L42:T42))","v":47},{"$f":"IF(COUNTBLANK(V42:W42)>0,\"\",SUM(V42:W42))","v":93},{"$f":"VLOOKUP(AA42,$B$301:$E$340,4)","v":27},{"$f":"LEN(X42)","v":2},23]
[null,"Austin Douglas - 10",6,6,3,5,5,4,6,5,7,8,6,5,6,6,7,6,5,7,null,{"$f":"IF(COUNTBLANK(C43:K43)>0,\"\",SUM(C43:K43))","v":47},{"$f":"IF(COUNTBLANK(L43:T43)>0,\"\",SUM(L43:T43))","v":56},{"$f":"IF(COUNTBLANK(V43:W43)>0,\"\",SUM(V43:W43))","v":103},{"$f":"VLOOKUP(AA43,$B$301:$E$340,4)","v":35},{"$f":"LEN(X43)","v":3},24]
[null,"Trevor  Reierson - 11",5,6,3,6,7,4,7,5,5,5,4,5,6,5,6,6,5,5,null,{"$f":"IF(COUNTBLANK(C44:K44)>0,\"\",SUM(C44:K44))","v":48},{"$f":"IF(COUNTBLANK(L44:T44)>0,\"\",SUM(L44:T44))","v":47},{"$f":"IF(COUNTBLANK(V44:W44)>0,\"\",SUM(V44:W44))","v":95},{"$f":"VLOOKUP(AA44,$B$301:$E$340,4)","v":30},{"$f":"LEN(X44)","v":2},25]
[null,null,null,null,null,null,null,null,null,null,null,null,null,null,null,null,null,null,null,null,null,null,null,{"$f":"IF(COUNT(X40:X44)=5,(SUM(X40:X44))-(MAX(X40:X44)),(IF(COUNT(X40:X44)=4,SUM(X40:X44),IF(COUNTBLANK(X40:X44)>0,SUM(X40:X44),\"DQ\"))))","v":367},{"$f":"J355","v":7},null,105]
[null,null,null,null,null,null,null,null,null,null,null,null,null,null,null,null,null,null,null,null,null,null,null,{"$f":"IF(COUNT(X40:X44)=5,MAX(X40:X44),IF(COUNT(X40:X44)<5,500,))","v":103}]
[null,"WEST BEND EAST"]
[null,"Devon Hanson - 11",4,4,4,4,4,4,6,4,3,4,5,3,3,5,4,3,6,5,null,{"$f":"IF(COUNTBLANK(C48:K48)>0,\"\",SUM(C48:K48))","v":37},{"$f":"IF(COUNTBLANK(L48:T48)>0,\"\",SUM(L48:T48))","v":38},{"$f":"IF(COUNTBLANK(V48:W48)>0,\"\",SUM(V48:W48))","v":75},{"$f":"VLOOKUP(AA48,$B$301:$E$340,4)","v":1},{"$f":"LEN(X48)","v":2},26]
[null,"Mitch Saari - 12",5,4,4,5,5,6,5,5,4,6,4,6,5,5,6,3,4,6,null,{"$f":"IF(COUNTBLANK(C49:K49)>0,\"\",SUM(C49:K49))","v":43},{"$f":"IF(COUNTBLANK(L49:T49)>0,\"\",SUM(L49:T49))","v":45},{"$f":"IF(COUNTBLANK(V49:W49)>0,\"\",SUM(V49:W49))","v":88},{"$f":"VLOOKUP(AA49,$B$301:$E$340,4)","v":17},{"$f":"LEN(X49)","v":2},27]
[null,"Josh Breuer - 12",5,5,4,5,4,5,9,6,5,6,7,4,4,6,6,4,7,6,null,{"$f":"IF(COUNTBLANK(C50:K50)>0,\"\",SUM(C50:K50))","v":48},{"$f":"IF(COUNTBLANK(L50:T50)>0,\"\",SUM(L50:T50))","v":50},{"$f":"IF(COUNTBLANK(V50:W50)>0,\"\",SUM(V50:W50))","v":98},{"$f":"VLOOKUP(AA50,$B$301:$E$340,4)","v":32},{"$f":"LEN(X50)","v":2},28]
[null,"Sam Struebing - 11",4,5,3,6,5,6,6,7,4,6,5,6,4,7,6,6,4,7,null,{"$f":"IF(COUNTBLANK(C51:K51)>0,\"\",SUM(C51:K51))","v":46},{"$f":"IF(COUNTBLANK(L51:T51)>0,\"\",SUM(L51:T51))","v":51},{"$f":"IF(COUNTBLANK(V51:W51)>0,\"\",SUM(V51:W51))","v":97},{"$f":"VLOOKUP(AA51,$B$301:$E$340,4)","v":31},{"$f":"LEN(X51)","v":2},29]
[null,"Brad Halverson - 9",4,5,3,6,5,6,5,7,5,6,3,5,4,5,5,4,5,6,null,{"$f":"IF(COUNTBLANK(C52:K52)>0,\"\",SUM(C52:K52))","v":46},{"$f":"IF(COUNTBLANK(L52:T52)>0,\"\",SUM(L52:T52))","v":43},{"$f":"IF(COUNTBLANK(V52:W52)>0,\"\",SUM(V52:W52))","v":89},{"$f":"VLOOKUP(AA52,$B$301:$E$340,4)","v":18},{"$f":"LEN(X52)","v":2},30]
[null,null,null,null,null,null,null,null,null,null,null,null,null,null,null,null,null,null,null,null,null,null,null,{"$f":"IF(COUNT(X48:X52)=5,(SUM(X48:X52))-(MAX(X48:X52)),(IF(COUNT(X48:X52)=4,SUM(X48:X52),IF(COUNTBLANK(X48:X52)>0,SUM(X48:X52),\"DQ\"))))","v":349},{"$f":"J356","v":5},null,106]
[null,null,null,null,null,null,null,null,null,null,null,null,null,null,null,null,null,null,null,null,null,null,null,{"$f":"IF(COUNT(X48:X52)=5,MAX(X48:X52),IF(COUNT(X48:X52)<5,500,))","v":98}]
[null,"WEST BEND WEST"]
[null,"Alex Haas - 12",5,5,4,5,4,6,5,4,4,5,5,4,4,4,4,4,5,6,null,{"$f":"IF(COUNTBLANK(C56:K56)>0,\"\",SUM(C56:K56))","v":42},{"$f":"IF(COUNTBLANK(L56:T56)>0,\"\",SUM(L56:T56))","v":41},{"$f":"IF(COUNTBLANK(V56:W56)>0,\"\",SUM(V56:W56))","v":83},{"$f":"VLOOKUP(AA56,$B$301:$E$340,4)","v":10},{"$f":"LEN(X56)","v":2},31]
[null,"Max Rohlinger - 10",5,6,1,4,4,5,5,3,5,4,3,4,5,4,4,3,5,5,null,{"$f":"IF(COUNTBLANK(C57:K57)>0,\"\",SUM(C57:K57))","v":38},{"$f":"IF(COUNTBLANK(L57:T57)>0,\"\",SUM(L57:T57))","v":37},{"$f":"IF(COUNTBLANK(V57:W57)>0,\"\",SUM(V57:W57))","v":75},{"$f":"VLOOKUP(AA57,$B$301:$E$340,4)","v":1},{"$f":"LEN(X57)","v":2},32]
[null,"Kevin Albrecht - 11",4,4,4,5,6,4,6,4,5,3,4,6,4,4,5,4,6,6,null,{"$f":"IF(COUNTBLANK(C58:K58)>0,\"\",SUM(C58:K58))","v":42},{"$f":"IF(COUNTBLANK(L58:T58)>0,\"\",SUM(L58:T58))","v":42},{"$f":"IF(COUNTBLANK(V58:W58)>0,\"\",SUM(V58:W58))","v":84},{"$f":"VLOOKUP(AA58,$B$301:$E$340,4)","v":12},{"$f":"LEN(X58)","v":2},33]
[null,"Jacob Droese - 12",5,6,4,4,5,4,8,5,5,6,5,5,4,5,6,4,5,7,null,{"$f":"IF(COUNTBLANK(C59:K59)>0,\"\",SUM(C59:K59))","v":46},{"$f":"IF(COUNTBLANK(L59:T59)>0,\"\",SUM(L59:T59))","v":47},{"$f":"IF(COUNTBLANK(V59:W59)>0,\"\",SUM(V59:W59))","v":93},{"$f":"VLOOKUP(AA59,$B$301:$E$340,4)","v":27},{"$f":"LEN(X59)","v":2},34]
[null,"Nick Meucci - 12",5,5,5,5,7,4,7,5,5,6,5,4,4,5,6,4,4,5,null,{"$f":"IF(COUNTBLANK(C60:K60)>0,\"\",SUM(C60:K60))","v":48},{"$f":"IF(COUNTBLANK(L60:T60)>0,\"\",SUM(L60:T60))","v":43},{"$f":"IF(COUNTBLANK(V60:W60)>0,\"\",SUM(V60:W60))","v":91},{"$f":"VLOOKUP(AA60,$B$301:$E$340,4)","v":21},{"$f":"LEN(X60)","v":2},35]
[null,null,null,null,null,null,null,null,null,null,null,null,null,null,null,null,null,null,null,null,null,null,null,{"$f":"IF(COUNT(X56:X60)=5,(SUM(X56:X60))-(MAX(X56:X60)),(IF(COUNT(X56:X60)=4,SUM(X56:X60),IF(COUNTBLANK(X56:X60)>0,SUM(X56:X60),\"DQ\"))))","v":333},{"$f":"J357","v":2},null,107]
[null,null,null,null,null,null,null,null,null,null,null,null,null,null,null,null,null,null,null,null,null,null,null,{"$f":"IF(COUNT(X56:X60)=5,MAX(X56:X60),IF(COUNT(X56:X60)<5,500,))","v":93}]
[null,"WISCONSIN LUTHERAN"]
[null,"Scratch #1 - x",9,9,9,9,9,9,9,9,9,9,9,9,9,9,9,9,9,9,null,{"$f":"IF(COUNTBLANK(C64:K64)>0,\"\",SUM(C64:K64))","v":81},{"$f":"IF(COUNTBLANK(L64:T64)>0,\"\",SUM(L64:T64))","v":81},{"$f":"IF(COUNTBLANK(V64:W64)>0,\"\",SUM(V64:W64))","v":162},{"$f":"VLOOKUP(AA64,$B$301:$E$340,4)","v":39},{"$f":"LEN(X64)","v":3},36]
[null,"Scratch #2 - x",9,9,9,9,9,9,9,9,9,9,9,9,9,9,9,9,9,9,null,{"$f":"IF(COUNTBLANK(C65:K65)>0,\"\",SUM(C65:K65))","v":81},{"$f":"IF(COUNTBLANK(L65:T65)>0,\"\",SUM(L65:T65))","v":81},{"$f":"IF(COUNTBLANK(V65:W65)>0,\"\",SUM(V65:W65))","v":162},{"$f":"VLOOKUP(AA65,$B$301:$E$340,4)","v":39},{"$f":"LEN(X65)","v":3},37]
[null,"Zachary Stahle - 12",5,6,4,5,4,7,8,5,6,5,7,5,5,5,7,5,6,6,null,{"$f":"IF(COUNTBLANK(C66:K66)>0,\"\",SUM(C66:K66))","v":50},{"$f":"IF(COUNTBLANK(L66:T66)>0,\"\",SUM(L66:T66))","v":51},{"$f":"IF(COUNTBLANK(V66:W66)>0,\"\",SUM(V66:W66))","v":101},{"$f":"VLOOKUP(AA66,$B$301:$E$340,4)","v":34},{"$f":"LEN(X66)","v":3},38]
[null,"Ben Krause - 12",4,5,5,6,6,5,6,4,5,5,5,4,4,5,6,5,6,5,null,{"$f":"IF(COUNTBLANK(C67:K67)>0,\"\",SUM(C67:K67))","v":46},{"$f":"IF(COUNTBLANK(L67:T67)>0,\"\",SUM(L67:T67))","v":45},{"$f":"IF(COUNTBLANK(V67:W67)>0,\"\",SUM(V67:W67))","v":91},{"$f":"VLOOKUP(AA67,$B$301:$E$340,4)","v":21},{"$f":"LEN(X67)","v":2},39]
[null,"Brendan Hausch - 10",6,8,6,5,7,6,7,8,7,8,8,7,5,11,8,6,8,7,null,{"$f":"IF(COUNTBLANK(C68:K68)>0,\"\",SUM(C68:K68))","v":60},{"$f":"IF(COUNTBLANK(L68:T68)>0,\"\",SUM(L68:T68))","v":68},{"$f":"IF(COUNTBLANK(V68:W68)>0,\"\",SUM(V68:W68))","v":128},{"$f":"VLOOKUP(AA68,$B$301:$E$340,4)","v":38},{"$f":"LEN(X68)","v":3},40]
[null,null,null,null,null,null,null,null,null,null,null,null,null,null,null,null,null,null,null,null,null,null,null,{"$f":"IF(COUNT(X64:X68)=5,(SUM(X64:X68))-(MAX(X64:X68)),(IF(COUNT(X64:X68)=4,SUM(X64:X68),IF(COUNTBLANK(X64:X68)>0,SUM(X64:X68),\"DQ\"))))","v":482},{"$f":"J358","v":8},null,108]
[null,"Medalists: (75) - Devon Hanson, Max Rohlinger",null,null,null,null,null,null,null,null,null,null,null,null,null,null,null,null,null,null,null,null,null,{"$f":"IF(COUNT(X64:X68)=5,MAX(X64:X68),IF(COUNT(X64:X68)<5,500,))","v":162}]
[]
[null,"Weather:  55 degrees, overcast, very calm.  "]
[]
[]
[]
[]
[]
[]
[]
[]
[]
[]
[]
[]
[]
[]
[]
[]
[]
[]
[]
[]
[]
[]
[]
[]
[]
[]
[]
[]
[]
[]
[]
[]
[]
[]
[]
[]
[]
[null,"Course   ","Fire Ridge Country Club"]
[null,"Hole   ",1,2,3,4,5,6,7,8,9,10,11,12,13,14,15,16,17,18,null,"Front","Back","Total","Place"]
[null,"  Par   ",4,4,3,5,4,5,4,3,4,5,3,4,4,5,4,4,3,4,null,{"$f":"SUM(C112:$K112)","v":36},{"$f":"SUM(L112:T112)","v":36},{"$f":"SUM(C112:T112)","v":72}]
[null,"Handicap  ",9,11,17,1,5,3,13,15,7,4,16,14,12,2,10,8,18,6]
[]
[null,"Course   ","Horicon Hills Golf Club"]
[null,"Hole   ",1,2,3,4,5,6,7,8,9,10,11,12,13,14,15,16,17,18,null,"Front","Back","Total","Place"]
[null,"  Par   ",4,4,3,4,4,3,5,4,4,4,4,4,3,4,4,3,4,5,null,{"$f":"SUM(C117:K117)","v":35},{"$f":"SUM(L117:T117)","v":35},{"$f":"SUM(C117:T117)","v":70}]
[null,"Handicap  ",6,14,18,10,4,16,2,8,12,11,9,13,15,5,7,17,1,3]
[]
[]
[]
[]
[]
[]
[]
[]
[]
[]
[]
[]
[]
[]
[]
[]
[]
[]
[]
[]
[]
[]
[]
[]
[]
[]
[]
[]
[]
[]
[]
[]
[]
[]
[]
[]
[]
[]
[]
[]
[]
[]
[]
[]
[]
[]
[]
[]
[]
[]
[]
[]
[]
[]
[]
[]
[]
[]
[]
[]
[]
[]
[]
[]
[]
[]
[]
[]
[]
[]
[]
[]
[]
[]
[]
[]
[]
[]
[]
[]
[]
[]
[]
[]
[]
[]
[]
[]
[]
[]
[]
[]
[]
[]
[]
[]
[]
[]
[]
[]
[]
[]
[]
[]
[]
[]
[]
[]
[]
[]
[]
[]
[]
[]
[]
[]
[]
[]
[]
[]
[]
[]
[]
[]
[]
[]
[]
[]
[]
[]
[]
[]
[]
[]
[]
[]
[]
[]
[]
[]
[]
[]
[]
[]
[]
[]
[]
[]
[]
[]
[]
[]
[]
[]
[]
[]
[]
[]
[]
[]
[]
[]
[]
[]
[]
[]
[]
[]
[]
[]
[]
[]
[]
[]
[]
[]
[]
[]
[]
[]
[]
[null,"Player","Sc","Sort","Rnk"]
[null,1,{"$f":"$X$8","v":81},1,6]
[null,2,{"$f":"$X$9","v":89},2,18]
[null,3,{"$f":"$X$22","v":107},3,36]
[null,4,{"$f":"$X$11","v":98},4,32]
[null,5,{"$f":"$X$12","v":92},5,24]
[null,6,{"$f":"$X$16","v":79},6,4]
[null,7,{"$f":"$X$17","v":92},7,24]
[null,8,{"$f":"$X$18","v":82},8,7]
[null,9,{"$f":"$X$19","v":89},9,18]
[null,11,{"$f":"$X$24","v":82},11,7]
[null,12,{"$f":"$X$25","v":82},12,7]
[null,13,{"$f":"$X$26","v":78},13,3]
[null,14,{"$f":"$X$27","v":85},14,13]
[null,15,{"$f":"$X$28","v":93},15,27]
[null,16,{"$f":"$X$32","v":83},16,10]
[null,17,{"$f":"$X$33","v":91},17,21]
[null,18,{"$f":"$X$34","v":80},18,5]
[null,19,{"$f":"$X$35","v":87},19,15]
[null,20,{"$f":"$X$36","v":86},20,14]
[null,21,{"$f":"$X$40","v":87},21,15]
[null,22,{"$f":"$X$41","v":92},22,24]
[null,22,{"$f":"$X$20","v":107},22,36]
[null,23,{"$f":"$X$42","v":93},23,27]
[null,24,{"$f":"$X$43","v":103},24,35]
[null,25,{"$f":"$X$44","v":95},25,30]
[null,26,{"$f":"$X$48","v":75},26,1]
[null,27,{"$f":"$X$49","v":88},27,17]
[null,28,{"$f":"$X$50","v":98},28,32]
[null,29,{"$f":"$X$51","v":97},29,31]
[null,30,{"$f":"$X$52","v":89},30,18]
[null,31,{"$f":"$X$56","v":83},31,10]
[null,32,{"$f":"$X$57","v":75},32,1]
[null,33,{"$f":"$X$58","v":84},33,12]
[null,34,{"$f":"$X$59","v":93},34,27]
[null,35,{"$f":"$X$60","v":91},35,21]
[null,36,{"$f":"$X$64","v":162},36,39]
[null,37,{"$f":"$X$65","v":162},37,39]
[null,38,{"$f":"$X$66","v":101},38,34]
[null,39,{"$f":"$X$67","v":91},39,21]
[null,40,{"$f":"$X$68","v":128},40,38]
[]
[]
[null,{"$f":"B71","v":0}]
[]
[]
[]
[]
[]
[null,null,null,null,null,null,null,null,null,null,null,null,null,null,null,null,null,"Handicap Holes"]
[null,"Team Number",1,2,3,4,5,null,"Tot","Rank",null,null,null,null,null,null,null,{"$f":"MATCH(1,$C$4:$T$4,0)","v":17},{"$f":"MATCH(2,$C$4:$T$4,0)","v":7},{"$f":"MATCH(3,$C$4:$T$4,0)","v":18},{"$f":"MATCH(4,$C$4:$T$4,0)","v":5},{"$f":"MATCH(5,$C$4:$T$4,0)","v":14},{"$f":"MATCH(6,$C$4:$T$4,0)","v":1},{"$f":"MATCH(7,$C$4:$T$4,0)","v":15},{"$f":"MATCH(8,$C$4:$T$4,0)","v":8},{"$f":"MATCH(8,$C$4:$T$4,0)","v":8},{"$f":"MATCH(9,$C$4:$T$4,0)","v":11}]
[null,1,{"$f":"IF(ISNUMBER($X$8),$X$8,500)","v":81},{"$f":"IF(ISNUMBER($X$9),$X$9,500)","v":89},{"$f":"IF(ISNUMBER($X$10),$X$10,500)","v":103},{"$f":"IF(ISNUMBER($X$11),$X$11,500)","v":98},{"$f":"IF(ISNUMBER($X$12),$X$12,500)","v":92},{"$f":"$X$14","v":103},{"$f":"SUM(C351:G351)-H351","v":360},6,null,6,null,null,null,null,null,27,29,31,25,26,28,32,24,24]
[null,2,{"$f":"IF(ISNUMBER($X$16),$X$16,500)","v":79},{"$f":"IF(ISNUMBER($X$17),$X$17,500)","v":92},{"$f":"IF(ISNUMBER($X$18),$X$18,500)","v":82},{"$f":"IF(ISNUMBER($X$19),$X$19,500)","v":89},{"$f":"IF(ISNUMBER($X$20),$X$20,500)","v":107},{"$f":"$X$22","v":107},{"$f":"SUM(C352:G352)-H352","v":342},4,null,4,null,null,null,null,null,23,29,28,29,23,24,31,24,24]
[null,3,{"$f":"IF(ISNUMBER($X$24),$X$24,500)","v":82},{"$f":"IF(ISNUMBER($X$25),$X$25,500)","v":82},{"$f":"IF(ISNUMBER($X$26),$X$26,500)","v":78},{"$f":"IF(ISNUMBER($X$27),$X$27,500)","v":85},{"$f":"IF(ISNUMBER($X$28),$X$28,500)","v":93},{"$f":"$X$30","v":93},{"$f":"SUM(C353:G353)-H353","v":327},1,null,1,null,null,null,null,null,25,29,31,23,20,24,25,25,25]
[null,4,{"$f":"IF(ISNUMBER($X$32),$X$32,500)","v":83},{"$f":"IF(ISNUMBER($X$33),$X$33,500)","v":91},{"$f":"IF(ISNUMBER($X$34),$X$34,500)","v":80},{"$f":"IF(ISNUMBER($X$35),$X$35,500)","v":87},{"$f":"IF(ISNUMBER($X$36),$X$36,500)","v":86},{"$f":"$X$38","v":91},{"$f":"SUM(C354:G354)-H354","v":336},3,null,3,null,null,null,null,null,27,31,32,25,26,23,27,20,20]
[null,5,{"$f":"IF(ISNUMBER($X$40),$X$40,500)","v":87},{"$f":"IF(ISNUMBER($X$41),$X$41,500)","v":92},{"$f":"IF(ISNUMBER($X$42),$X$42,500)","v":93},{"$f":"IF(ISNUMBER($X$43),$X$43,500)","v":103},{"$f":"IF(ISNUMBER($X$44),$X$44,500)","v":95},{"$f":"$X$46","v":103},{"$f":"SUM(C355:G355)-H355","v":367},7,null,7,null,null,null,null,null,26,29,31,28,27,26,25,26,26]
[null,6,{"$f":"IF(ISNUMBER($X$48),$X$48,500)","v":75},{"$f":"IF(ISNUMBER($X$49),$X$49,500)","v":88},{"$f":"IF(ISNUMBER($X$50),$X$50,500)","v":98},{"$f":"IF(ISNUMBER($X$51),$X$51,500)","v":97},{"$f":"IF(ISNUMBER($X$52),$X$52,500)","v":89},{"$f":"$X$54","v":98},{"$f":"SUM(C356:G356)-H356","v":349},5,null,5,null,null,null,null,null,26,31,30,23,28,22,27,29,29]
[null,7,{"$f":"IF(ISNUMBER($X$56),$X$56,500)","v":83},{"$f":"IF(ISNUMBER($X$57),$X$57,500)","v":75},{"$f":"IF(ISNUMBER($X$58),$X$58,500)","v":84},{"$f":"IF(ISNUMBER($X$59),$X$59,500)","v":93},{"$f":"IF(ISNUMBER($X$60),$X$60,500)","v":91},{"$f":"$X$62","v":93},{"$f":"SUM(C357:G357)-H357","v":333},2,null,2,null,null,null,null,null,25,31,29,26,22,24,25,21,21]
[null,8,{"$f":"IF(ISNUMBER($X$64),$X$64,500)","v":162},{"$f":"IF(ISNUMBER($X$65),$X$65,500)","v":162},{"$f":"IF(ISNUMBER($X$66),$X$66,500)","v":101},{"$f":"IF(ISNUMBER($X$67),$X$67,500)","v":91},{"$f":"IF(ISNUMBER($X$68),$X$68,500)","v":128},{"$f":"$X$70","v":162},{"$f":"SUM(C358:G358)-H358","v":482},8,null,8,null,null,null,null,null,38,39,36,35,39,33,39,35,35]
[]
[]
[]
[]
[]
[]
[]
[]
[]
[]
[]
[]
[]
[]
[]
[]
[]
[]
[]
[]
[]
[]
[]
[]
[]
[]
[]
[]
[]
[]
[]
[]
[]
[]
[]
[]
[]
[]
[]
[]
[]
[]
[null,{"$f":"B8","v":"Koby Jones - 12"},{"$f":"IF(X8=200,Y8,X8)","v":81}]
[null,{"$f":"B9","v":"Thomas Bleich - 11"},{"$f":"IF(X9=200,Y9,X9)","v":89}]
[null,{"$f":"B10","v":"Cody Trotter - 12"},{"$f":"IF(X10=200,Y10,X10)","v":103}]
[null,{"$f":"B11","v":"Jacob Smith - 10"},{"$f":"IF(X11=200,Y11,X11)","v":98}]
[null,{"$f":"B12","v":"Carter Smith - 11"},{"$f":"IF(X12=200,Y12,X12)","v":92}]
[null,{"$f":"B16","v":"Ryan Ruona - 11"},{"$f":"IF(X16=200,Y16,X16)","v":79}]
[null,{"$f":"B17","v":"Adam Butler - 12"},{"$f":"IF(X17=200,Y17,X17)","v":92}]
[null,{"$f":"B18","v":"Luke Carroll - 10"},{"$f":"IF(X18=200,Y18,X18)","v":82}]
[null,{"$f":"B19","v":"Lucas Hass - 11"},{"$f":"IF(X19=200,Y19,X19)","v":89}]
[null,{"$f":"B20","v":"Zak Brooks - 10"},{"$f":"IF(X20=200,Y20,X20)","v":107}]
[null,{"$f":"B24","v":"George Kneiser - 11"},{"$f":"IF(X24=200,Y24,X24)","v":82}]
[null,{"$f":"B25","v":"Colin Prom - 12"},{"$f":"IF(X25=200,Y25,X25)","v":82}]
[null,{"$f":"B26","v":"Joey Ploch - 9"},{"$f":"IF(X26=200,Y26,X26)","v":78}]
[null,{"$f":"B27","v":"Brett Lange - 12"},{"$f":"IF(X27=200,Y27,X27)","v":85}]
[null,{"$f":"B28","v":"Allan Moutvic - 12"},{"$f":"IF(X28=200,Y28,X28)","v":93}]
[null,{"$f":"B32","v":"Jack Burns - 12"},{"$f":"IF(X32=200,Y32,X32)","v":83}]
[null,{"$f":"B33","v":"Chris Evans - 11"},{"$f":"IF(X33=200,Y33,X33)","v":91}]
[null,{"$f":"B34","v":"Austin Walsh - 12"},{"$f":"IF(X34=200,Y34,X34)","v":80}]
[null,{"$f":"B35","v":"Ryan Graunke - 12"},{"$f":"IF(X35=200,Y35,X35)","v":87}]
[null,{"$f":"B36","v":"Ryan Kusek - 9"},{"$f":"IF(X36=200,Y36,X36)","v":86}]
[null,{"$f":"B40","v":"Cameron Boyd - 11"},{"$f":"IF(X40=200,Y40,X40)","v":87}]
[null,{"$f":"B41","v":"Alex Thompson - 9"},{"$f":"IF(X41=200,Y41,X41)","v":92}]
[null,{"$f":"B42","v":"Collin Travis - 11"},{"$f":"IF(X42=200,Y42,X42)","v":93}]
[null,{"$f":"B43","v":"Austin Douglas - 10"},{"$f":"IF(X43=200,Y43,X43)","v":103}]
[null,{"$f":"B44","v":"Trevor  Reierson - 11"},{"$f":"IF(X44=200,Y44,X44)","v":95}]
[null,{"$f":"B48","v":"Devon Hanson - 11"},{"$f":"IF(X48=200,Y48,X48)","v":75}]
[null,{"$f":"B49","v":"Mitch Saari - 12"},{"$f":"IF(X49=200,Y49,X49)","v":88}]
[null,{"$f":"B50","v":"Josh Breuer - 12"},{"$f":"IF(X50=200,Y50,X50)","v":98}]
[null,{"$f":"B51","v":"Sam Struebing - 11"},{"$f":"IF(X51=200,Y51,X51)","v":97}]
[null,{"$f":"B52","v":"Brad Halverson - 9"},{"$f":"IF(X52=200,Y52,X52)","v":89}]
[null,{"$f":"B56","v":"Alex Haas - 12"},{"$f":"IF(X56=200,Y56,X56)","v":83}]
[null,{"$f":"B57","v":"Max Rohlinger - 10"},{"$f":"IF(X57=200,Y57,X57)","v":75}]
[null,{"$f":"B58","v":"Kevin Albrecht - 11"},{"$f":"IF(X58=200,Y58,X58)","v":84}]
[null,{"$f":"B59","v":"Jacob Droese - 12"},{"$f":"IF(X59=200,Y59,X59)","v":93}]
[null,{"$f":"B60","v":"Nick Meucci - 12"},{"$f":"IF(X60=200,Y60,X60)","v":91}]
[null,{"$f":"B64","v":"Scratch #1 - x"},{"$f":"IF(X64=200,Y64,X64)","v":162}]
[null,{"$f":"B65","v":"Scratch #2 - x"},{"$f":"IF(X65=200,Y65,X65)","v":162}]
[null,{"$f":"B66","v":"Zachary Stahle - 12"},{"$f":"IF(X66=200,Y66,X66)","v":101}]
[null,{"$f":"B67","v":"Ben Krause - 12"},{"$f":"IF(X67=200,Y67,X67)","v":91}]
[null,{"$f":"B68","v":"Brendan Hausch - 10"},{"$f":"IF(X68=200,Y68,X68)","v":128}]

{"sheet":"Standings","index":9,"n_rows":24,"n_cols":27,"rows_kept":24,"cut":false,"hidden":false,"merged":[[0,0,0,10],[15,9,15,10],[16,9,16,10],[17,9,17,10],[12,0,12,10],[23,9,23,10],[14,9,14,10],[18,9,18,10],[19,9,19,10],[20,9,20,10],[21,9,21,10],[22,9,22,10]]}
[{"$f":"\"WISCONSIN LITTLE TEN CONFERENCE STANDINGS \" & Schedule!A1","v":"WISCONSIN LITTLE TEN CONFERENCE STANDINGS 2015"},null,null,null,null,null,null,null,null,null,null,null,null,null,null,null,null,null,null,null,null,null,null,null,null,null,9]
["Match  ","1",2,3,4,5,6,7,8,9,"Total"]
[{"$f":"Rosters!$B$10","v":"West Bend West"},1,1,2,2,5,1,1,3,4,{"$f":"IF(SUM(B3:J3)=0,\"\",SUM(B3:J3))","v":20}]
[{"$f":"Rosters!$B$6","v":"Oconomowoc"},2,3,3,1,3,3,3,1,2,{"$f":"IF(SUM(B4:J4)=0,\"\",SUM(B4:J4))","v":21}]
[{"$f":"Rosters!$B$7","v":"Slinger"},4,6,1,3,2,4,4,2,6,{"$f":"IF(SUM(B5:J5)=0,\"\",SUM(B5:J5))","v":32}]
[{"$f":"Rosters!$B$4","v":"Beaver Dam"},3,2,4,6,1,2,2,6,12,{"$f":"IF(SUM(B6:J6)=0,\"\",SUM(B6:J6))","v":38}]
[{"$f":"Rosters!$B$9","v":"West Bend East"},5,4,6,5,4,5,6,4,10,{"$f":"IF(SUM(B7:J7)=0,\"\",SUM(B7:J7))","v":49}]
[{"$f":"Rosters!$B$5","v":"Hartford"},6,5,5,4,6,6,5,5,8,{"$f":"IF(SUM(B8:J8)=0,\"\",SUM(B8:J8))","v":50}]
[{"$f":"Rosters!$B$8","v":"Watertown"},7,7,7,7,7,7,7,7,14,{"$f":"IF(SUM(B9:J9)=0,\"\",SUM(B9:J9))","v":70}]
[{"$f":"Rosters!$B$11","v":"Wisconsin Lutheran"},8,8,8,8,8,8,8,8,16,{"$f":"IF(SUM(B10:J10)=0,\"\",SUM(B10:J10))","v":80}]
[]
[]
[{"$f":"Schedule!A1 & \" WLT Conference Schedule\"","v":"2015 WLT Conference Schedule"}]
[]
["Match #        Host School",null,null,"Location",null,null,null,null,null,"Date"]
["   #1           Wisconsin Lutheran",null,null,"New Berlin Hills Golf Course",null,null,null,null,null,"2015-04-14"]
["   #2           West Bend West",null,null,"West Bend Country Club",null,null,null,null,null,"2015-04-20"]
["   #3           West Bend East",null,null,"West Bend Country Club",null,null,null,null,null,"2015-04-27"]
["   #4           Watertown",null,null,"Watertown Country Club",null,null,null,null,null,"2015-04-30"]
["   #5           Oconomowoc",null,null,"Oconomowoc Golf Club",null,null,null,null,null,"2015-05-04"]
["   #6           Beaver Dam",null,null,"Old Hickory Golf Club",null,null,null,null,null,"2015-05-06"]
["   #7           Hartford",null,null,"Hartford Golf Club",null,null,null,null,null,"2015-05-12"]
["   #8           Slinger",null,null,"Washington County Golf Course",null,null,null,null,null,"2015-05-13"]
["   #9           Conference Finals",null,null,"Rock River Hills Golf Club",null,null,null,null,null,"2015-05-20"]

{"sheet":"ALL CONFERENCE TEAMS","index":10,"n_rows":32,"n_cols":6,"rows_kept":32,"cut":false,"hidden":false,"merged":[]}
["PLACE","NAME","GRADE","SCHOOL ",null,"TOTAL STROKES INCLUDING ONE THROW OUT NINE"]
[]
["FIRST TEAM WLT ALL CONFERENCE"]
[]
[1,"Devon Hanson",11,"WBE",42,310.5]
[2,"George Kneiser",11,"OC",44,322]
[3,"Austin Walsh",12,"SL",46,323]
[4,"Max Rohlinger",10,"WBW",43,325.5]
[5,"Koby Jones",12,"BD",46,328.5]
[]
["SECOND TEAM WLT ALL CONFERENCE"]
[]
[6,"Kevin Albrecht",11,"WBW",49,330]
[7,"Colin Prom",12,"OC",48,332]
[8,"Alex Haas",12,"WBW",46,333.5]
[9,"Mitch Saari",12,"WBE",47,335]
[10,"Jack Burns",12,"SL",47,336.5]
[]
["THIRD TEAM WLT ALL CONFERENCE"]
[]
[11,"Ryan Ruona",11,"HT",47,338.5]
[12,"Joey Ploch",9,"OC","NS",344]
[13,"Nick Meucci",12,"WBW","NS",345.5]
[14,"Thomas Bleich",11,"BD","NS",346.5]
[15,"Carter Smith",11,"BD",51,359]
[]
[]
[null,"NOTE:  THE  TOTAL STROKES INCLUDES THE CONFERENCE CHAMPIONSHIP "]
[null,"18 HOLE ROUND SCORE, WHICH IS CALCULATED AS AN AVERAGE OF THE "]
[null,"TWO NINE HOLE ROUNDS.  THIS TOTAL IS MADE UP OF THE PLAYER'S 8"]
[null,"BEST NINE HOLE ROUNDS OUT OF 9, THROWING OUT THE PLAYER'S "]
[null,"HIGHEST NINE HOLE ROUND TO COMPILE THE TOTAL. "]

{"sheet":"FINAL PlayerStats","index":11,"n_rows":74,"n_cols":23,"rows_kept":74,"cut":false,"hidden":false,"merged":[]}
["WLT Player Rankings - 2015",null,null,null,"ROUND",null,null,null,null,null,null,null,"Rd 1-8",null,null,null,"Throw",null,null,null,null,null,"Overall"]
[54,null,null,null,"#1","#2","#3","#4","#5","#6","#7","#8","Total",null,null,null,"Out",null,null,null,"#9",null,"Total"]
["Rank","Name","Grade","School","WL","WBW","WBE","WT","OC","BD","HT","SL","Conf",null,null,null,"Score",null,null,null,"Conf",null,"Strokes"]
[1,"Devon Hanson",11,"WBE",38,41,41,37,40,38,42,38,273,null,37.5,{"$f":"M4+O4","v":310.5},42,null,null,null,75,{"$f":"U4/2","v":37.5},348]
[2,"George Kneiser",11,"OC",42,44,42,41,44,35,38,39,281,null,41,{"$f":"M5+O5","v":322},44,null,null,null,82,{"$f":"U5/2","v":41},363]
[3,"Austin Walsh",12,"SL",46,45,34,43,43,42,39,37,283,null,40,{"$f":"M6+O6","v":323},46,null,null,null,80,{"$f":"U6/2","v":40},363]
[4,"Max Rohlinger",10,"WBW",42,40,43,42,40,41,43,40,288,null,37.5,{"$f":"M7+O7","v":325.5},43,null,null,null,75,{"$f":"U7/2","v":37.5},363]
[5,"Koby Jones",12,"BD",40,42,40,39,43,42,42,46,288,null,40.5,{"$f":"M8+O8","v":328.5},46,null,null,null,81,{"$f":"U8/2","v":40.5},369]
[6,"Kevin Albrecht",11,"WBW",42,40,45,40,49,40,42,39,288,null,42,{"$f":"M9+O9","v":330},49,null,null,null,84,{"$f":"U9/2","v":42},372]
[7,"Colin Prom",12,"OC",40,44,48,41,39,44,43,40,291,null,41,{"$f":"M10+O10","v":332},48,null,null,null,82,{"$f":"U10/2","v":41},373]
[8,"Alex Haas",12,"WBW",42,37,43,45,46,43,39,43,292,null,41.5,{"$f":"M11+O11","v":333.5},46,null,null,null,83,{"$f":"U11/2","v":41.5},375]
[9,"Mitch Saari",12,"WBE",47,41,40,45,41,39,45,40,291,null,44,{"$f":"M12+O12","v":335},47,null,null,null,88,{"$f":"U12/2","v":44},379]
[10,"Jack Burns",12,"SL",39,45,47,43,38,42,46,42,295,null,41.5,{"$f":"M13+O13","v":336.5},47,null,null,null,83,{"$f":"U13/2","v":41.5},378]
[11,"Ryan Ruona",11,"HT",38,43,46,46,42,47,42,42,299,null,39.5,{"$f":"M14+O14","v":338.5},47,null,null,null,79,{"$f":"U14/2","v":39.5},378]
[12,"Joey Ploch",9,"OC",null,44,44,41,44,47,46,39,305,null,39,{"$f":"M15+O15","v":344},"NS",null,null,null,78,{"$f":"U15/2","v":39},383]
[13,"Nick Meucci",12,"WBW",null,47,45,43,40,40,44,41,300,null,45.5,{"$f":"M16+O16","v":345.5},"NS",null,null,null,91,{"$f":"U16/2","v":45.5},391]
[14,"Thomas Bleich",11,"BD",48,null,44,44,43,41,40,42,302,null,44.5,{"$f":"M17+O17","v":346.5},"NS",null,null,null,89,{"$f":"U17/2","v":44.5},391]
[15,"Carter Smith",11,"BD",44,44,51,45,42,41,46,51,313,null,46,{"$f":"M18+O18","v":359},51,null,null,null,92,{"$f":"U18/2","v":46},405]
[16,"Chris Evans",11,"SL",43,51,43,40,45,47,null,47,316,null,45.5,{"$f":"M19+O19","v":361.5},"NS",null,null,null,91,{"$f":"U19/2","v":45.5},407]
[17,"Jacob Droese",12,"WBW",46,47,43,45,53,43,42,49,315,null,46.5,{"$f":"M20+O20","v":361.5},53,null,null,null,93,{"$f":"U20/2","v":46.5},408]
[18,"Cody Trotter",12,"BD",43,43,48,51,42,43,45,47,311,null,51.5,{"$f":"M21+O21","v":362.5},51,null,null,null,103,{"$f":"U21/2","v":51.5},414]
[19,"Jacob Smith",10,"BD",48,46,null,48,42,44,44,43,315,null,49,{"$f":"M22+O22","v":364},"NS",null,null,null,98,{"$f":"U22/2","v":49},413]
[20,"Lucas Hass",11,"HT",50,49,45,42,46,47,47,44,320,null,44.5,{"$f":"M23+O23","v":364.5},50,null,null,null,89,{"$f":"U23/2","v":44.5},409]
[21,"Adam Butler",12,"HT",null,45,46,44,48,47,46,43,319,null,46,{"$f":"M24+O24","v":365},"NS",null,null,null,92,{"$f":"U24/2","v":46},411]
[22,"Cameron Boyd",11,"WT",44,48,46,43,47,50,51,44,322,null,43.5,{"$f":"M25+O25","v":365.5},51,null,null,null,87,{"$f":"U25/2","v":43.5},409]
[23,"Luke Carroll",11,"HT",57,45,48,43,47,50,46,47,326,null,41,{"$f":"M26+O26","v":367},57,null,null,null,82,{"$f":"U26/2","v":41},408]
[24,"Collin Travis",11,"WT",57,47,48,48,49,45,39,45,321,null,46.5,{"$f":"M27+O27","v":367.5},57,null,null,null,93,{"$f":"U27/2","v":46.5},414]
[25,"Brett Lange",12,"OC",49,55,45,45,81,48,45,41,328,null,42.5,{"$f":"M28+O28","v":370.5},81,null,null,null,85,{"$f":"U28/2","v":42.5},413]
[26,"Alex Thompson",9,"WT",45,50,52,42,48,47,54,47,331,null,46,{"$f":"M29+O29","v":377},54,null,null,null,92,{"$f":"U29/2","v":46},423]
[27,"Josh Breuer",12,"WBE",49,47,48,47,51,54,48,40,330,null,49,{"$f":"M30+O30","v":379},54,null,null,null,98,{"$f":"U30/2","v":49},428]
[28,"John Turchi",10,"HT",51,48,47,45,49,44,null,null,384,null,0,{"$f":"M31+O31","v":384},"NS",null,null,null,null,{"$f":"U31/2","v":0},384]
[29,"Ben Krause",11,"WL",49,53,53,45,45,52,46,53,343,null,45.5,{"$f":"M32+O32","v":388.5},53,null,null,null,91,{"$f":"U32/2","v":45.5},434]
[30,"Brad Halverson",9,"WBE",49,50,55,51,46,60,48,48,347,null,44.5,{"$f":"M33+O33","v":391.5},60,null,null,null,89,{"$f":"U33/2","v":44.5},436]
[31,"Sam Struebing",11,"WBE",49,48,56,46,48,49,50,53,343,null,48.5,{"$f":"M34+O34","v":391.5},56,null,null,null,97,{"$f":"U34/2","v":48.5},440]
[32,"Trevor  Reierson",11,"WT",null,55,55,44,48,52,53,50,357,null,47.5,{"$f":"M35+O35","v":404.5},"NS",null,null,null,95,{"$f":"U35/2","v":47.5},452]
[33,"Ryan Kusek",9,"SL",null,null,44,44,45,46,44,43,366,null,43,{"$f":"M36+O36","v":409},"NS",null,null,null,86,{"$f":"U36/2","v":43},452]
[34,"Austin Douglas",10,"WT",50,64,48,51,55,58,42,55,359,null,51.5,{"$f":"M37+O37","v":410.5},64,null,null,null,103,{"$f":"U37/2","v":51.5},462]
[35,"Allan Moutvic",12,"OC",42,43,54,45,44,44,null,null,372,null,46.5,{"$f":"M38+O38","v":418.5},"NS",null,null,null,93,{"$f":"U38/2","v":46.5},465]
[36,"Zachary Stahle",11,"WL",47,47,56,null,null,47,49,45,391,null,50.5,{"$f":"M39+O39","v":441.5},"NS",null,null,null,101,{"$f":"U39/2","v":50.5},492]
[37,"Ryan Erdmann",10,"SL",48,null,null,46,48,56,null,null,498,null,0,{"$f":"M40+O40","v":498},"NS",null,null,null,null,{"$f":"U40/2","v":0},498]
[38,"Ryan Graunke",12,"SL",null,51,50,null,null,null,47,41,489,null,43.5,{"$f":"M41+O41","v":532.5},"NS",null,null,null,87,{"$f":"U41/2","v":43.5},576]
[39,"Scratch #1","x","WL",81,81,81,81,81,81,81,81,567,null,0,{"$f":"M42+O42","v":567},81,null,null,null,null,{"$f":"U42/2","v":0},567]
[40,"Scratch #2","x","WL",81,81,81,81,81,81,81,81,567,null,0,{"$f":"M43+O43","v":567},81,null,null,null,null,{"$f":"U43/2","v":0},567]
[41,"Scratch #3","x","WL",81,81,81,81,81,null,null,81,586,null,0,{"$f":"M44+O44","v":586},"NS",null,null,null,null,{"$f":"U44/2","v":0},586]
[42,"Brendan Hausch",10,"WL",null,null,null,56,59,52,58,null,525,null,64,{"$f":"M45+O45","v":589},"NS",null,null,null,128,{"$f":"U45/2","v":64},653]
[43,"Drew Cook",11,"OC",null,null,null,null,null,null,49,47,596,null,0,{"$f":"M46+O46","v":596},"NS",null,null,null,null,{"$f":"U46/2","v":0},596]
[44,"Ryan Henning",null,"BD",null,51,51,null,null,null,null,null,602,null,0,{"$f":"M47+O47","v":602},"NS",null,null,null,null,{"$f":"U47/2","v":0},602]
[45,"Mike Vanderheiden",10,"HT",null,null,null,null,null,null,53,49,602,null,0,{"$f":"M48+O48","v":602},"NS",null,null,null,null,{"$f":"U48/2","v":0},602]
[46,"Marvin Bateman ",11,"WBW",45,null,null,null,null,null,null,null,645,null,0,{"$f":"M49+O49","v":645},"NS",null,null,null,null,{"$f":"U49/2","v":0},645]
[47,"Cody Trotter",12,"BD",null,null,null,null,null,null,45,null,645,null,0,{"$f":"M50+O50","v":645},"NS",null,null,null,null,{"$f":"U50/2","v":0},645]
[48,"Nick Gliniecki",11,"SL",null,null,null,null,null,null,47,null,647,null,0,{"$f":"M51+O51","v":647},"NS",null,null,null,null,{"$f":"U51/2","v":0},647]
[49,"Jake Lidwin",11,"HT",50,null,null,null,null,null,null,null,650,null,0,{"$f":"M52+O52","v":650},"NS",null,null,null,null,{"$f":"U52/2","v":0},650]
[50,"Howie Wolf",12,"SL",50,null,null,null,null,null,null,null,650,null,0,{"$f":"M53+O53","v":650},"NS",null,null,null,null,{"$f":"U53/2","v":0},650]
[51,"Sam Hosch",12,"OC",51,null,null,null,null,null,null,null,651,null,0,{"$f":"M54+O54","v":651},"NS",null,null,null,null,{"$f":"U54/2","v":0},651]
[52,"Bryan Laude",12,"SL",null,56,null,null,null,null,null,null,656,null,0,{"$f":"M55+O55","v":656},"NS",null,null,null,null,{"$f":"U55/2","v":0},656]
[53,"Dylan Rahfaldt",9,"WT",58,null,null,null,null,null,null,null,658,null,0,{"$f":"M56+O56","v":658},"NS",null,null,null,null,{"$f":"U56/2","v":0},658]
[54,"Zak Brooks",10,"HT",null,null,null,null,null,null,null,null,807,null,53.5,{"$f":"M57+O57","v":860.5},"NS",null,null,null,107,{"$f":"U57/2","v":53.5},914]
[null,null,null,null,null,null,null,null,null,null,null,null,0,null,null,null,0,null,null,null,null,null,0]
[null,null,null,null,null,null,null,null,null,null,null,null,0,null,null,null,0,null,null,null,null,null,0]
[null,null,null,null,null,null,null,null,null,null,null,null,0,null,null,null,0,null,null,null,null,null,0]
[null,null,null,null,null,null,null,null,null,null,null,null,0,null,null,null,0,null,null,null,null,null,0]
[null,null,null,null,null,null,null,null,null,null,null,null,0,null,null,null,0,null,null,null,null,null,0]
[null,null,null,null,null,null,null,null,null,null,null,null,0,null,null,null,0,null,null,null,null,null,0]
[null,null,null,null,null,null,null,null,null,null,null,null,0,null,null,null,0,null,null,null,null,null,0]
[null,null,null,null,null,null,null,null,null,null,null,null,0,null,null,null,0,null,null,null,null,null,0]
[null,null,null,null,null,null,null,null,null,null,null,null,0,null,null,null,0,null,null,null,null,null,0]
[null,null,null,null,null,null,null,null,null,null,null,null,0,null,null,null,0,null,null,null,null,null,0]
[null,null,null,null,null,null,null,null,null,null,null,null,0,null,null,null,0,null,null,null,null,null,0]
[null,null,null,null,null,null,null,null,null,null,null,null,0,null,null,null,0,null,null,null,null,null,0]
[null,null,null,null,null,null,null,null,null,null,null,null,0,null,null,null,0,null,null,null,null,null,0]
[null,null,null,null,null,null,null,null,null,null,null,null,0,null,null,null,0,null,null,null,null,null,0]
[null,null,null,null,null,null,null,null,null,null,null,null,0,null,null,null,0,null,null,null,null,null,0]
[null,null,null,null,null,null,null,null,null,null,null,null,0,null,null,null,0,null,null,null,null,null,0]
[null,null,null,null,null,null,null,null,null,null,null,null,0,null,null,null,0,null,null,null,null,null,0]

{"sheet":"DISREGARD STANDINGS PlayerStats","index":12,"n_rows":151,"n_cols":37,"rows_kept":151,"cut":false,"hidden":false,"merged":[[0,4,0,11]]}
[{"$f":"\"WLT Player Rankings - \" & Schedule!A1","v":"WLT Player Rankings - 2015"},null,null,null,"ROUND",null,null,null,null,null,null,null,"Rd 1-8",null,"Overall","Throw",null,null,null,null,null,null,null,null,null,null,{"$f":"Standings!AA1","v":9}]
[{"$f":"COUNTA(B4:B96)","v":54},null,null,null,"#1","#2","#3","#4","#5","#6","#7","#8","Total","#9","Total","Out",null,null,null,null,null,null,null,null,null,null,"#1","#2","#3","#4","#5","#6","#7","#8","#9","Total","Max"]
["Rank","Name","Grade","School","WL","WBW","WBE","WT","OC","BD","HT","SL","Conf","Conf","Strokes","Score",null,null,null,null,null,null,null,null,null,null,null,null,null,null,null,null,null,null,null,{"$f":"IF($AA$1 = 1, SUM(AA3:AH3),SUM(AA3:AH3)-MAX(AA3:AH3)+AI3)","v":0},{"$f":"MAX(AA3:AH3)","v":0}]
[1,"Devon Hanson",11,"WBE",38,41,41,37,40,38,42,38,{"$f":"AJ4-AI4","v":273},75,{"$f":"M4+N4","v":348},{"$f":"IF(AK4=100,\"NS\",AK4)","v":42},null,null,null,null,null,null,null,null,null,null,38,41,41,37,40,38,42,38,75,{"$f":"IF($AA$1 = 1, SUM(AA4:AH4),SUM(AA4:AH4)-MAX(AA4:AH4)+AI4)","v":348},{"$f":"MAX(AA4:AH4)","v":42}]
[2,"Max Rohlinger",10,"WBW",42,40,43,42,40,41,43,40,{"$f":"AJ5-AI5","v":288},75,{"$f":"M5+N5","v":363},{"$f":"IF(AK5=100,\"NS\",AK5)","v":43},null,"DISREGARD THESE STANDINGS",null,null,null,null,null,null,null,null,42,40,43,42,40,41,43,40,75,{"$f":"IF($AA$1 = 1, SUM(AA5:AH5),SUM(AA5:AH5)-MAX(AA5:AH5)+AI5)","v":363},{"$f":"MAX(AA5:AH5)","v":43}]
[3,"Austin Walsh",12,"SL",46,45,34,43,43,42,39,37,{"$f":"AJ6-AI6","v":283},80,{"$f":"M6+N6","v":363},{"$f":"IF(AK6=100,\"NS\",AK6)","v":46},null,"THESE RESULTS ",null,null,null,null,null,null,null,null,46,45,34,43,43,42,39,37,80,{"$f":"IF($AA$1 = 1, SUM(AA6:AH6),SUM(AA6:AH6)-MAX(AA6:AH6)+AI6)","v":363},{"$f":"MAX(AA6:AH6)","v":46}]
[4,"George Kneiser",11,"OC",42,44,42,41,44,35,38,39,{"$f":"AJ7-AI7","v":281},82,{"$f":"M7+N7","v":363},{"$f":"IF(AK7=100,\"NS\",AK7)","v":44},null,"ARE NOT CALCULATED ",null,null,null,null,null,null,null,null,42,44,42,41,44,35,38,39,82,{"$f":"IF($AA$1 = 1, SUM(AA7:AH7),SUM(AA7:AH7)-MAX(AA7:AH7)+AI7)","v":363},{"$f":"MAX(AA7:AH7)","v":44}]
[5,"Koby Jones",12,"BD",40,42,40,39,43,42,42,46,{"$f":"AJ8-AI8","v":288},81,{"$f":"M8+N8","v":369},{"$f":"IF(AK8=100,\"NS\",AK8)","v":46},null,"USING THE AVERAGE OF ",null,null,null,null,null,null,null,null,40,42,40,39,43,42,42,46,81,{"$f":"IF($AA$1 = 1, SUM(AA8:AH8),SUM(AA8:AH8)-MAX(AA8:AH8)+AI8)","v":369},{"$f":"MAX(AA8:AH8)","v":46}]
[6,"Kevin Albrecht",11,"WBW",42,40,45,40,49,40,42,39,{"$f":"AJ9-AI9","v":288},84,{"$f":"M9+N9","v":372},{"$f":"IF(AK9=100,\"NS\",AK9)","v":49},null,"THE TWO NINES ",null,null,null,null,null,null,null,null,42,40,45,40,49,40,42,39,84,{"$f":"IF($AA$1 = 1, SUM(AA9:AH9),SUM(AA9:AH9)-MAX(AA9:AH9)+AI9)","v":372},{"$f":"MAX(AA9:AH9)","v":49}]
[7,"Colin Prom",12,"OC",40,44,48,41,39,44,43,40,{"$f":"AJ10-AI10","v":291},82,{"$f":"M10+N10","v":373},{"$f":"IF(AK10=100,\"NS\",AK10)","v":48},null,"IN THE CONFERENCE",null,null,null,null,null,null,null,null,40,44,48,41,39,44,43,40,82,{"$f":"IF($AA$1 = 1, SUM(AA10:AH10),SUM(AA10:AH10)-MAX(AA10:AH10)+AI10)","v":373},{"$f":"MAX(AA10:AH10)","v":48}]
[8,"Alex Haas",12,"WBW",42,37,43,45,46,43,39,43,{"$f":"AJ11-AI11","v":292},83,{"$f":"M11+N11","v":375},{"$f":"IF(AK11=100,\"NS\",AK11)","v":46},null,"CHAMPIONSHIP. ",null,null,null,null,null,null,null,null,42,37,43,45,46,43,39,43,83,{"$f":"IF($AA$1 = 1, SUM(AA11:AH11),SUM(AA11:AH11)-MAX(AA11:AH11)+AI11)","v":375},{"$f":"MAX(AA11:AH11)","v":46}]
[9,"Ryan Ruona",11,"HT",38,43,46,46,42,47,42,42,{"$f":"AJ12-AI12","v":299},79,{"$f":"M12+N12","v":378},{"$f":"IF(AK12=100,\"NS\",AK12)","v":47},null,null,null,null,null,null,null,null,null,null,38,43,46,46,42,47,42,42,79,{"$f":"IF($AA$1 = 1, SUM(AA12:AH12),SUM(AA12:AH12)-MAX(AA12:AH12)+AI12)","v":378},{"$f":"MAX(AA12:AH12)","v":47}]
[10,"Jack Burns",12,"SL",39,45,47,43,38,42,46,42,{"$f":"AJ13-AI13","v":295},83,{"$f":"M13+N13","v":378},{"$f":"IF(AK13=100,\"NS\",AK13)","v":47},null,"THE CALCULATIONS HERE",null,null,null,null,null,null,null,null,39,45,47,43,38,42,46,42,83,{"$f":"IF($AA$1 = 1, SUM(AA13:AH13),SUM(AA13:AH13)-MAX(AA13:AH13)+AI13)","v":378},{"$f":"MAX(AA13:AH13)","v":47}]
[11,"Mitch Saari",12,"WBE",47,41,40,45,41,39,45,40,{"$f":"AJ14-AI14","v":291},88,{"$f":"M14+N14","v":379},{"$f":"IF(AK14=100,\"NS\",AK14)","v":47},null,"DO NOT REFLECT THE ",null,null,null,null,null,null,null,null,47,41,40,45,41,39,45,40,88,{"$f":"IF($AA$1 = 1, SUM(AA14:AH14),SUM(AA14:AH14)-MAX(AA14:AH14)+AI14)","v":379},{"$f":"MAX(AA14:AH14)","v":47}]
[12,"Joey Ploch",9,"OC",null,44,44,41,44,47,46,39,{"$f":"AJ15-AI15","v":305},78,{"$f":"M15+N15","v":383},{"$f":"IF(AK15=100,\"NS\",AK15)","v":"NS"},null,"ACTUAL CALCULATED ",null,null,null,null,null,null,null,null,100,44,44,41,44,47,46,39,78,{"$f":"IF($AA$1 = 1, SUM(AA15:AH15),SUM(AA15:AH15)-MAX(AA15:AH15)+AI15)","v":383},{"$f":"MAX(AA15:AH15)","v":100}]
[13,"Thomas Bleich",11,"BD",48,null,44,44,43,41,40,42,{"$f":"AJ16-AI16","v":302},89,{"$f":"M16+N16","v":391},{"$f":"IF(AK16=100,\"NS\",AK16)","v":"NS"},null,"TOTAL THAT IS USED ",null,null,null,null,null,null,null,null,48,100,44,44,43,41,40,42,89,{"$f":"IF($AA$1 = 1, SUM(AA16:AH16),SUM(AA16:AH16)-MAX(AA16:AH16)+AI16)","v":391},{"$f":"MAX(AA16:AH16)","v":100}]
[14,"Nick Meucci",12,"WBW",null,47,45,43,40,40,44,41,{"$f":"AJ17-AI17","v":300},91,{"$f":"M17+N17","v":391},{"$f":"IF(AK17=100,\"NS\",AK17)","v":"NS"},null,"TO DETERMINE FINAL POSITION ",null,null,null,null,null,null,null,null,100,47,45,43,40,40,44,41,91,{"$f":"IF($AA$1 = 1, SUM(AA17:AH17),SUM(AA17:AH17)-MAX(AA17:AH17)+AI17)","v":391},{"$f":"MAX(AA17:AH17)","v":100}]
[15,"Carter Smith",11,"BD",44,44,51,45,42,41,46,51,{"$f":"AJ18-AI18","v":313},92,{"$f":"M18+N18","v":405},{"$f":"IF(AK18=100,\"NS\",AK18)","v":51},null,"IN THE INDIVIDUAL ",null,null,null,null,null,null,null,null,44,44,51,45,42,41,46,51,92,{"$f":"IF($AA$1 = 1, SUM(AA18:AH18),SUM(AA18:AH18)-MAX(AA18:AH18)+AI18)","v":405},{"$f":"MAX(AA18:AH18)","v":51}]
[16,"Chris Evans",11,"SL",43,51,43,40,45,47,null,47,{"$f":"AJ19-AI19","v":316},91,{"$f":"M19+N19","v":407},{"$f":"IF(AK19=100,\"NS\",AK19)","v":"NS"},null,"CONFERENCE MEDALIST",null,null,null,null,null,null,null,null,43,51,43,40,45,47,100,47,91,{"$f":"IF($AA$1 = 1, SUM(AA19:AH19),SUM(AA19:AH19)-MAX(AA19:AH19)+AI19)","v":407},{"$f":"MAX(AA19:AH19)","v":100}]
[17,"Luke Carroll",11,"HT",57,45,48,43,47,50,46,47,{"$f":"AJ20-AI20","v":326},82,{"$f":"M20+N20","v":408},{"$f":"IF(AK20=100,\"NS\",AK20)","v":57},null,"STANDING. ",null,null,null,null,null,null,null,null,57,45,48,43,47,50,46,47,82,{"$f":"IF($AA$1 = 1, SUM(AA20:AH20),SUM(AA20:AH20)-MAX(AA20:AH20)+AI20)","v":408},{"$f":"MAX(AA20:AH20)","v":57}]
[18,"Jacob Droese",12,"WBW",46,47,43,45,53,43,42,49,{"$f":"AJ21-AI21","v":315},93,{"$f":"M21+N21","v":408},{"$f":"IF(AK21=100,\"NS\",AK21)","v":53},null,null,null,null,null,null,null,null,null,null,46,47,43,45,53,43,42,49,93,{"$f":"IF($AA$1 = 1, SUM(AA21:AH21),SUM(AA21:AH21)-MAX(AA21:AH21)+AI21)","v":408},{"$f":"MAX(AA21:AH21)","v":53}]
[19,"Cameron Boyd",11,"WT",44,48,46,43,47,50,51,44,{"$f":"AJ22-AI22","v":322},87,{"$f":"M22+N22","v":409},{"$f":"IF(AK22=100,\"NS\",AK22)","v":51},null,"THE TOTALS DISPLAYED HERE",null,null,null,null,null,null,null,null,44,48,46,43,47,50,51,44,87,{"$f":"IF($AA$1 = 1, SUM(AA22:AH22),SUM(AA22:AH22)-MAX(AA22:AH22)+AI22)","v":409},{"$f":"MAX(AA22:AH22)","v":51}]
[20,"Lucas Hass",11,"HT",50,49,45,42,46,47,47,44,{"$f":"AJ23-AI23","v":320},89,{"$f":"M23+N23","v":409},{"$f":"IF(AK23=100,\"NS\",AK23)","v":50},null,"USE EACH PLAYER'S LOWEST",null,null,null,null,null,null,null,null,50,49,45,42,46,47,47,44,89,{"$f":"IF($AA$1 = 1, SUM(AA23:AH23),SUM(AA23:AH23)-MAX(AA23:AH23)+AI23)","v":409},{"$f":"MAX(AA23:AH23)","v":50}]
[21,"Adam Butler",12,"HT",null,45,46,44,48,47,46,43,{"$f":"AJ24-AI24","v":319},92,{"$f":"M24+N24","v":411},{"$f":"IF(AK24=100,\"NS\",AK24)","v":"NS"},null,"SEVEN 9-HOLE ROUNDS OF ",null,null,null,null,null,null,null,null,100,45,46,44,48,47,46,43,92,{"$f":"IF($AA$1 = 1, SUM(AA24:AH24),SUM(AA24:AH24)-MAX(AA24:AH24)+AI24)","v":411},{"$f":"MAX(AA24:AH24)","v":100}]
[22,"Brett Lange",12,"OC",49,55,45,45,81,48,45,41,{"$f":"AJ25-AI25","v":328},85,{"$f":"M25+N25","v":413},{"$f":"IF(AK25=100,\"NS\",AK25)","v":81},null,"THEIR EIGHT ROUNDS PLAYED, ",null,null,null,null,null,null,null,null,49,55,45,45,81,48,45,41,85,{"$f":"IF($AA$1 = 1, SUM(AA25:AH25),SUM(AA25:AH25)-MAX(AA25:AH25)+AI25)","v":413},{"$f":"MAX(AA25:AH25)","v":81}]
[23,"Jacob Smith",10,"BD",48,46,null,48,42,44,44,43,{"$f":"AJ26-AI26","v":315},98,{"$f":"M26+N26","v":413},{"$f":"IF(AK26=100,\"NS\",AK26)","v":"NS"},null,"AND IT INCLUDES THE 18 HOLE",null,null,null,null,null,null,null,null,48,46,100,48,42,44,44,43,98,{"$f":"IF($AA$1 = 1, SUM(AA26:AH26),SUM(AA26:AH26)-MAX(AA26:AH26)+AI26)","v":413},{"$f":"MAX(AA26:AH26)","v":100}]
[24,"Collin Travis",11,"WT",57,47,48,48,49,45,39,45,{"$f":"AJ27-AI27","v":321},93,{"$f":"M27+N27","v":414},{"$f":"IF(AK27=100,\"NS\",AK27)","v":57},null,"CONFERENCE CHAMPIONSHIP",null,null,null,null,null,null,null,null,57,47,48,48,49,45,39,45,93,{"$f":"IF($AA$1 = 1, SUM(AA27:AH27),SUM(AA27:AH27)-MAX(AA27:AH27)+AI27)","v":414},{"$f":"MAX(AA27:AH27)","v":57}]
[25,"Cody Trotter",12,"BD",43,43,48,51,42,43,45,47,{"$f":"AJ28-AI28","v":311},103,{"$f":"M28+N28","v":414},{"$f":"IF(AK28=100,\"NS\",AK28)","v":51},null,"TOTAL, NOT AN AVERAGE OF THE ",null,null,null,null,null,null,null,null,43,43,48,51,42,43,45,47,103,{"$f":"IF($AA$1 = 1, SUM(AA28:AH28),SUM(AA28:AH28)-MAX(AA28:AH28)+AI28)","v":414},{"$f":"MAX(AA28:AH28)","v":51}]
[26,"Alex Thompson",9,"WT",45,50,52,42,48,47,54,47,{"$f":"AJ29-AI29","v":331},92,{"$f":"M29+N29","v":423},{"$f":"IF(AK29=100,\"NS\",AK29)","v":54},null,"TWO NINES AS IS WRITTEN IN THE ",null,null,null,null,null,null,null,null,45,50,52,42,48,47,54,47,92,{"$f":"IF($AA$1 = 1, SUM(AA29:AH29),SUM(AA29:AH29)-MAX(AA29:AH29)+AI29)","v":423},{"$f":"MAX(AA29:AH29)","v":54}]
[27,"Josh Breuer",12,"WBE",49,47,48,47,51,54,48,40,{"$f":"AJ30-AI30","v":330},98,{"$f":"M30+N30","v":428},{"$f":"IF(AK30=100,\"NS\",AK30)","v":54},null,"WLT BYLAWS FOR BOYS GOLF. ",null,null,null,null,null,null,null,null,49,47,48,47,51,54,48,40,98,{"$f":"IF($AA$1 = 1, SUM(AA30:AH30),SUM(AA30:AH30)-MAX(AA30:AH30)+AI30)","v":428},{"$f":"MAX(AA30:AH30)","v":54}]
[28,"Ben Krause",11,"WL",49,53,53,45,45,52,46,53,{"$f":"AJ31-AI31","v":343},91,{"$f":"M31+N31","v":434},{"$f":"IF(AK31=100,\"NS\",AK31)","v":53},null,null,null,null,null,null,null,null,null,null,49,53,53,45,45,52,46,53,91,{"$f":"IF($AA$1 = 1, SUM(AA31:AH31),SUM(AA31:AH31)-MAX(AA31:AH31)+AI31)","v":434},{"$f":"MAX(AA31:AH31)","v":53}]
[29,"Brad Halverson",9,"WBE",49,50,55,51,46,60,48,48,{"$f":"AJ32-AI32","v":347},89,{"$f":"M32+N32","v":436},{"$f":"IF(AK32=100,\"NS\",AK32)","v":60},null,null,null,null,null,null,null,null,null,null,49,50,55,51,46,60,48,48,89,{"$f":"IF($AA$1 = 1, SUM(AA32:AH32),SUM(AA32:AH32)-MAX(AA32:AH32)+AI32)","v":436},{"$f":"MAX(AA32:AH32)","v":60}]
[30,"Sam Struebing",11,"WBE",49,48,56,46,48,49,50,53,{"$f":"AJ33-AI33","v":343},97,{"$f":"M33+N33","v":440},{"$f":"IF(AK33=100,\"NS\",AK33)","v":56},null,null,null,null,null,null,null,null,null,null,49,48,56,46,48,49,50,53,97,{"$f":"IF($AA$1 = 1, SUM(AA33:AH33),SUM(AA33:AH33)-MAX(AA33:AH33)+AI33)","v":440},{"$f":"MAX(AA33:AH33)","v":56}]
[31,"Ryan Kusek",9,"SL",null,null,44,44,45,46,44,43,{"$f":"AJ34-AI34","v":366},86,{"$f":"M34+N34","v":452},{"$f":"IF(AK34=100,\"NS\",AK34)","v":"NS"},null,null,null,null,null,null,null,null,null,null,100,100,44,44,45,46,44,43,86,{"$f":"IF($AA$1 = 1, SUM(AA34:AH34),SUM(AA34:AH34)-MAX(AA34:AH34)+AI34)","v":452},{"$f":"MAX(AA34:AH34)","v":100}]
[32,"Trevor  Reierson",11,"WT",null,55,55,44,48,52,53,50,{"$f":"AJ35-AI35","v":357},95,{"$f":"M35+N35","v":452},{"$f":"IF(AK35=100,\"NS\",AK35)","v":"NS"},null,null,null,null,null,null,null,null,null,null,100,55,55,44,48,52,53,50,95,{"$f":"IF($AA$1 = 1, SUM(AA35:AH35),SUM(AA35:AH35)-MAX(AA35:AH35)+AI35)","v":452},{"$f":"MAX(AA35:AH35)","v":100}]
[33,"Austin Douglas",10,"WT",50,64,48,51,55,58,42,55,{"$f":"AJ36-AI36","v":359},103,{"$f":"M36+N36","v":462},{"$f":"IF(AK36=100,\"NS\",AK36)","v":64},null,null,null,null,null,null,null,null,null,null,50,64,48,51,55,58,42,55,103,{"$f":"IF($AA$1 = 1, SUM(AA36:AH36),SUM(AA36:AH36)-MAX(AA36:AH36)+AI36)","v":462},{"$f":"MAX(AA36:AH36)","v":64}]
[34,"Allan Moutvic",12,"OC",42,43,54,45,44,44,null,null,{"$f":"AJ37-AI37","v":372},93,{"$f":"M37+N37","v":465},{"$f":"IF(AK37=100,\"NS\",AK37)","v":"NS"},null,null,null,null,null,null,null,null,null,null,42,43,54,45,44,44,100,100,93,{"$f":"IF($AA$1 = 1, SUM(AA37:AH37),SUM(AA37:AH37)-MAX(AA37:AH37)+AI37)","v":465},{"$f":"MAX(AA37:AH37)","v":100}]
[35,"Zachary Stahle",11,"WL",47,47,56,null,null,47,49,45,{"$f":"AJ38-AI38","v":391},101,{"$f":"M38+N38","v":492},{"$f":"IF(AK38=100,\"NS\",AK38)","v":"NS"},null,null,null,null,null,null,null,null,null,null,47,47,56,100,100,47,49,45,101,{"$f":"IF($AA$1 = 1, SUM(AA38:AH38),SUM(AA38:AH38)-MAX(AA38:AH38)+AI38)","v":492},{"$f":"MAX(AA38:AH38)","v":100}]
[36,"Ryan Graunke",12,"SL",null,51,50,null,null,null,47,41,{"$f":"AJ39-AI39","v":489},87,{"$f":"M39+N39","v":576},{"$f":"IF(AK39=100,\"NS\",AK39)","v":"NS"},null,null,null,null,null,null,null,null,null,null,100,51,50,100,100,100,47,41,87,{"$f":"IF($AA$1 = 1, SUM(AA39:AH39),SUM(AA39:AH39)-MAX(AA39:AH39)+AI39)","v":576},{"$f":"MAX(AA39:AH39)","v":100}]
[37,"John Turchi",10,"HT",51,48,47,45,49,44,null,null,{"$f":"AJ40-AI40","v":384},null,{"$f":"M40+N40","v":384},{"$f":"IF(AK40=100,\"NS\",AK40)","v":"NS"},null,null,null,null,null,null,null,null,null,null,51,48,47,45,49,44,100,100,200,{"$f":"IF($AA$1 = 1, SUM(AA40:AH40),SUM(AA40:AH40)-MAX(AA40:AH40)+AI40)","v":584},{"$f":"MAX(AA40:AH40)","v":100}]
[38,"Brendan Hausch",10,"WL",null,null,null,56,59,52,58,null,{"$f":"AJ41-AI41","v":525},128,{"$f":"M41+N41","v":653},{"$f":"IF(AK41=100,\"NS\",AK41)","v":"NS"},null,null,null,null,null,null,null,null,null,null,100,100,100,56,59,52,58,100,128,{"$f":"IF($AA$1 = 1, SUM(AA41:AH41),SUM(AA41:AH41)-MAX(AA41:AH41)+AI41)","v":653},{"$f":"MAX(AA41:AH41)","v":100}]
[39,"Ryan Erdmann",10,"SL",48,null,null,46,48,56,null,null,{"$f":"AJ42-AI42","v":498},null,{"$f":"M42+N42","v":498},{"$f":"IF(AK42=100,\"NS\",AK42)","v":"NS"},null,null,null,null,null,null,null,null,null,null,48,100,100,46,48,56,100,100,200,{"$f":"IF($AA$1 = 1, SUM(AA42:AH42),SUM(AA42:AH42)-MAX(AA42:AH42)+AI42)","v":698},{"$f":"MAX(AA42:AH42)","v":100}]
[40,"Scratch #1","x","WL",81,81,81,81,81,81,81,81,{"$f":"AJ43-AI43","v":567},162,{"$f":"M43+N43","v":729},{"$f":"IF(AK43=100,\"NS\",AK43)","v":81},null,null,null,null,null,null,null,null,null,null,81,81,81,81,81,81,81,81,162,{"$f":"IF($AA$1 = 1, SUM(AA43:AH43),SUM(AA43:AH43)-MAX(AA43:AH43)+AI43)","v":729},{"$f":"MAX(AA43:AH43)","v":81}]
[41,"Scratch #2","x","WL",81,81,81,81,81,81,81,81,{"$f":"AJ44-AI44","v":567},162,{"$f":"M44+N44","v":729},{"$f":"IF(AK44=100,\"NS\",AK44)","v":81},null,null,null,null,null,null,null,null,null,null,81,81,81,81,81,81,81,81,162,{"$f":"IF($AA$1 = 1, SUM(AA44:AH44),SUM(AA44:AH44)-MAX(AA44:AH44)+AI44)","v":729},{"$f":"MAX(AA44:AH44)","v":81}]
[42,"Scratch #3","x","WL",81,81,81,81,81,null,null,81,{"$f":"AJ45-AI45","v":586},null,{"$f":"M45+N45","v":586},{"$f":"IF(AK45=100,\"NS\",AK45)","v":"NS"},null,null,null,null,null,null,null,null,null,null,81,81,81,81,81,100,100,81,200,{"$f":"IF($AA$1 = 1, SUM(AA45:AH45),SUM(AA45:AH45)-MAX(AA45:AH45)+AI45)","v":786},{"$f":"MAX(AA45:AH45)","v":100}]
[43,"Drew Cook",11,"OC",null,null,null,null,null,null,49,47,{"$f":"AJ46-AI46","v":596},null,{"$f":"M46+N46","v":596},{"$f":"IF(AK46=100,\"NS\",AK46)","v":"NS"},null,null,null,null,null,null,null,null,null,null,100,100,100,100,100,100,49,47,200,{"$f":"IF($AA$1 = 1, SUM(AA46:AH46),SUM(AA46:AH46)-MAX(AA46:AH46)+AI46)","v":796},{"$f":"MAX(AA46:AH46)","v":100}]
[44,"Ryan Henning",null,"BD",null,51,51,null,null,null,null,null,{"$f":"AJ47-AI47","v":602},null,{"$f":"M47+N47","v":602},{"$f":"IF(AK47=100,\"NS\",AK47)","v":"NS"},null,null,null,null,null,null,null,null,null,null,100,51,51,100,100,100,100,100,200,{"$f":"IF($AA$1 = 1, SUM(AA47:AH47),SUM(AA47:AH47)-MAX(AA47:AH47)+AI47)","v":802},{"$f":"MAX(AA47:AH47)","v":100}]
[45,"Mike Vanderheiden",10,"HT",null,null,null,null,null,null,53,49,{"$f":"AJ48-AI48","v":602},null,{"$f":"M48+N48","v":602},{"$f":"IF(AK48=100,\"NS\",AK48)","v":"NS"},null,null,null,null,null,null,null,null,null,null,100,100,100,100,100,100,53,49,200,{"$f":"IF($AA$1 = 1, SUM(AA48:AH48),SUM(AA48:AH48)-MAX(AA48:AH48)+AI48)","v":802},{"$f":"MAX(AA48:AH48)","v":100}]
[46,"Zak Brooks",10,"HT",null,null,null,null,null,null,null,null,{"$f":"AJ49","v":807},107,{"$f":"M49+N49","v":914},{"$f":"IF(AK49=100,\"NS\",AK49)","v":"NS"},null,null,null,null,null,null,null,null,null,null,100,100,100,100,100,100,100,100,107,{"$f":"IF($AA$1 = 1, SUM(AA49:AH49),SUM(AA49:AH49)-MAX(AA49:AH49)+AI49)","v":807},{"$f":"MAX(AA49:AH49)","v":100}]
[47,"Marvin Bateman ",11,"WBW",45,null,null,null,null,null,null,null,{"$f":"AJ50-AI50","v":645},null,{"$f":"M50+N50","v":645},{"$f":"IF(AK50=100,\"NS\",AK50)","v":"NS"},null,null,null,null,null,null,null,null,null,null,45,100,100,100,100,100,100,100,200,{"$f":"IF($AA$1 = 1, SUM(AA50:AH50),SUM(AA50:AH50)-MAX(AA50:AH50)+AI50)","v":845},{"$f":"MAX(AA50:AH50)","v":100}]
[48,"Cody Trotter",12,"BD",null,null,null,null,null,null,45,null,{"$f":"AJ51-AI51","v":645},null,{"$f":"M51+N51","v":645},{"$f":"IF(AK51=100,\"NS\",AK51)","v":"NS"},null,null,null,null,null,null,null,null,null,null,100,100,100,100,100,100,45,100,200,{"$f":"IF($AA$1 = 1, SUM(AA51:AH51),SUM(AA51:AH51)-MAX(AA51:AH51)+AI51)","v":845},{"$f":"MAX(AA51:AH51)","v":100}]
[49,"Nick Gliniecki",11,"SL",null,null,null,null,null,null,47,null,{"$f":"AJ52-AI52","v":647},null,{"$f":"M52+N52","v":647},{"$f":"IF(AK52=100,\"NS\",AK52)","v":"NS"},null,null,null,null,null,null,null,null,null,null,100,100,100,100,100,100,47,100,200,{"$f":"IF($AA$1 = 1, SUM(AA52:AH52),SUM(AA52:AH52)-MAX(AA52:AH52)+AI52)","v":847},{"$f":"MAX(AA52:AH52)","v":100}]
[50,"Jake Lidwin",11,"HT",50,null,null,null,null,null,null,null,{"$f":"AJ53-AI53","v":650},null,{"$f":"M53+N53","v":650},{"$f":"IF(AK53=100,\"NS\",AK53)","v":"NS"},null,null,null,null,null,null,null,null,null,null,50,100,100,100,100,100,100,100,200,{"$f":"IF($AA$1 = 1, SUM(AA53:AH53),SUM(AA53:AH53)-MAX(AA53:AH53)+AI53)","v":850},{"$f":"MAX(AA53:AH53)","v":100}]
[51,"Howie Wolf",12,"SL",50,null,null,null,null,null,null,null,{"$f":"AJ54-AI54","v":650},null,{"$f":"M54+N54","v":650},{"$f":"IF(AK54=100,\"NS\",AK54)","v":"NS"},null,null,null,null,null,null,null,null,null,null,50,100,100,100,100,100,100,100,200,{"$f":"IF($AA$1 = 1, SUM(AA54:AH54),SUM(AA54:AH54)-MAX(AA54:AH54)+AI54)","v":850},{"$f":"MAX(AA54:AH54)","v":100}]
[52,"Sam Hosch",12,"OC",51,null,null,null,null,null,null,null,{"$f":"AJ55-AI55","v":651},null,{"$f":"M55+N55","v":651},{"$f":"IF(AK55=100,\"NS\",AK55)","v":"NS"},null,null,null,null,null,null,null,null,null,null,51,100,100,100,100,100,100,100,200,{"$f":"IF($AA$1 = 1, SUM(AA55:AH55),SUM(AA55:AH55)-MAX(AA55:AH55)+AI55)","v":851},{"$f":"MAX(AA55:AH55)","v":100}]
[53,"Bryan Laude",12,"SL",null,56,null,null,null,null,null,null,{"$f":"AJ56-AI56","v":656},null,{"$f":"M56+N56","v":656},{"$f":"IF(AK56=100,\"NS\",AK56)","v":"NS"},null,null,null,null,null,null,null,null,null,null,100,56,100,100,100,100,100,100,200,{"$f":"IF($AA$1 = 1, SUM(AA56:AH56),SUM(AA56:AH56)-MAX(AA56:AH56)+AI56)","v":856},{"$f":"MAX(AA56:AH56)","v":100}]
[54,"Dylan Rahfaldt",9,"WT",58,null,null,null,null,null,null,null,{"$f":"AJ57-AI57","v":658},null,{"$f":"M57+N57","v":658},{"$f":"IF(AK57=100,\"NS\",AK57)","v":"NS"},null,null,null,null,null,null,null,null,null,null,58,100,100,100,100,100,100,100,200,{"$f":"IF($AA$1 = 1, SUM(AA57:AH57),SUM(AA57:AH57)-MAX(AA57:AH57)+AI57)","v":858},{"$f":"MAX(AA57:AH57)","v":100}]
[null,null,null,null,null,null,null,null,null,null,null,null,{"$f":"AJ58","v":0},null,{"$f":"M58+N58","v":0},{"$f":"IF(AK58=100,\"NS\",AK58)","v":0},null,null,null,null,null,null,null,null,null,null,null,null,null,null,null,null,null,null,null,{"$f":"IF($AA$1 = 1, SUM(AA58:AH58),SUM(AA58:AH58)-MAX(AA58:AH58)+AI58)","v":0},{"$f":"MAX(AA58:AH58)","v":0}]
[null,null,null,null,null,null,null,null,null,null,null,null,0,null,0,0,null,null,null,null,null,null,null,null,null,null,null,null,null,null,null,null,null,null,null,0,0]
[null,null,null,null,null,null,null,null,null,null,null,null,0,null,0,0,null,null,null,null,null,null,null,null,null,null,null,null,null,null,null,null,null,null,null,0,0]
[null,null,null,null,null,null,null,null,null,null,null,null,0,null,0,0,null,null,null,null,null,null,null,null,null,null,null,null,null,null,null,null,null,null,null,0,0]
[null,null,null,null,null,null,null,null,null,null,null,null,0,null,0,0,null,null,null,null,null,null,null,null,null,null,null,null,null,null,null,null,null,null,null,0,0]
[null,null,null,null,null,null,null,null,null,null,null,null,0,null,0,0,null,null,null,null,null,null,null,null,null,null,null,null,null,null,null,null,null,null,null,0,0]
[null,null,null,null,null,null,null,null,null,null,null,null,0,null,0,0,null,null,null,null,null,null,null,null,null,null,null,null,null,null,null,null,null,null,null,0,0]
[null,null,null,null,null,null,null,null,null,null,null,null,0,null,{"$f":"M65+N65","v":0},0,null,null,null,null,null,null,null,null,null,null,null,null,null,null,null,null,null,null,null,{"$f":"IF($AA$1 = 1, SUM(AA65:AH65),SUM(AA65:AH65)-MAX(AA65:AH65)+AI65)","v":0},0]
[null,null,null,null,null,null,null,null,null,null,null,null,{"$f":"AJ66","v":0},null,0,0,null,null,null,null,null,null,null,null,null,null,null,null,null,null,null,null,null,null,null,{"$f":"IF($AA$1 = 1, SUM(AA66:AH66),SUM(AA66:AH66)-MAX(AA66:AH66)+AI66)","v":0},{"$f":"MAX(AA66:AH66)","v":0}]
[null,null,null,null,null,null,null,null,null,null,null,null,0,null,0,{"$f":"IF(AK67=100,\"NS\",AK67)","v":0},null,null,null,null,null,null,null,null,null,null,null,null,null,null,null,null,null,null,null,0,0]
[null,null,null,null,null,null,null,null,null,null,null,null,0,null,0,0,null,null,null,null,null,null,null,null,null,null,null,null,null,null,null,null,null,null,null,0,0]
[null,null,null,null,null,null,null,null,null,null,null,null,0,null,0,0,null,null,null,null,null,null,null,null,null,null,null,null,null,null,null,null,null,null,null,0,0]
[null,null,null,null,null,null,null,null,null,null,null,null,0,null,0,0,null,null,null,null,null,null,null,null,null,null,null,null,null,null,null,null,null,null,null,0,0]
[null,null,null,null,null,null,null,null,null,null,null,null,0,null,0,0,null,null,null,null,null,null,null,null,null,null,null,null,null,null,null,null,null,null,null,0,0]
[null,null,null,null,null,null,null,null,null,null,null,null,0,null,0,0,null,null,null,null,null,null,null,null,null,null,null,null,null,null,null,null,null,null,null,0,0]
[null,null,null,null,null,null,null,null,null,null,null,null,0,null,0,0,null,null,null,null,null,null,null,null,null,null,null,null,null,null,null,null,null,null,null,0,0]
[null,null,null,null,null,null,null,null,null,null,null,null,0,null,0,0,null,null,null,null,null,null,null,null,null,null,null,null,null,null,null,null,null,null,null,0,0]
[null,null,null,null,null,null,null,null,null,null,null,null,0,null,0,0,null,null,null,null,null,null,null,null,null,null,null,null,null,null,null,null,null,null,null,0,0]
[null,null,null,null,null,null,null,null,null,null,null,null,0,null,0,0,null,null,null,null,null,null,null,null,null,null,null,null,null,null,null,null,null,null,null,0,0]
[null,null,null,null,null,null,null,null,null,null,null,null,0,null,0,0,null,null,null,null,null,null,null,null,null,null,null,null,null,null,null,null,null,null,null,0,0]
[null,null,null,null,null,null,null,null,null,null,null,null,0,null,0,0,null,null,null,null,null,null,null,null,null,null,null,null,null,null,null,null,null,null,null,0,0]
[null,null,null,null,null,null,null,null,null,null,null,null,0,null,0,0,null,null,null,null,null,null,null,null,null,null,null,null,null,null,null,null,null,null,null,0,0]
[null,null,null,null,null,null,null,null,null,null,null,null,0,null,0,0,null,null,null,null,null,null,null,null,null,null,null,null,null,null,null,null,null,null,null,0,0]
[null,null,null,null,null,null,null,null,null,null,null,null,0,null,0,0,null,null,null,null,null,null,null,null,null,null,null,null,null,null,null,null,null,null,null,0,0]
[null,null,null,null,null,null,null,null,null,null,null,null,0,null,0,0,null,null,null,null,null,null,null,null,null,null,null,null,null,null,null,null,null,null,null,0,0]
[null,null,null,null,null,null,null,null,null,null,null,null,0,null,0,0,null,null,null,null,null,null,null,null,null,null,null,null,null,null,null,null,null,null,null,0,0]
[null,null,null,null,null,null,null,null,null,null,null,null,0,null,0,0,null,null,null,null,null,null,null,null,null,null,null,null,null,null,null,null,null,null,null,0,0]
[null,null,null,null,null,null,null,null,null,null,null,null,0,null,0,0,null,null,null,null,null,null,null,null,null,null,null,null,null,null,null,null,null,null,null,0,0]
[null,null,null,null,null,null,null,null,null,null,null,null,0,null,0,0,null,null,null,null,null,null,null,null,null,null,null,null,null,null,null,null,null,null,null,0,0]
[null,null,null,null,null,null,null,null,null,null,null,null,0,null,0,0,null,null,null,null,null,null,null,null,null,null,null,null,null,null,null,null,null,null,null,0,0]
[null,null,null,null,null,null,null,null,null,null,null,null,0,null,0,0,null,null,null,null,null,null,null,null,null,null,null,null,null,null,null,null,null,null,null,0,0]
[null,null,null,null,null,null,null,null,null,null,null,null,0,null,0,0,null,null,null,null,null,null,null,null,null,null,null,null,null,null,null,null,null,null,null,0,0]
[null,null,null,null,null,null,null,null,null,null,null,null,0,null,0,0,null,null,null,null,null,null,null,null,null,null,null,null,null,null,null,null,null,null,null,0,0]
[null,null,null,null,null,null,null,null,null,null,null,null,0,null,0,0,null,null,null,null,null,null,null,null,null,null,null,null,null,null,null,null,null,null,null,0,0]
[null,null,null,null,null,null,null,null,null,null,null,null,0,null,0,0,null,null,null,null,null,null,null,null,null,null,null,null,null,null,null,null,null,null,null,0,0]
[null,null,null,null,null,null,null,null,null,null,null,null,0,null,0,0,null,null,null,null,null,null,null,null,null,null,null,null,null,null,null,null,null,null,null,0,0]
[null,null,null,null,null,null,null,null,null,null,null,null,0,null,0,0,null,null,null,null,null,null,null,null,null,null,null,null,null,null,null,null,null,null,null,0,0]
[null,null,null,null,null,null,null,null,null,null,null,null,0,null,0,0,null,null,null,null,null,null,null,null,null,null,null,null,null,null,null,null,null,null,null,0,0]
[null,null,null,null,null,null,null,null,null,null,null,null,0,null,0,0,null,null,null,null,null,null,null,null,null,null,null,null,null,null,null,null,null,null,null,0,0]
[null,null,null,null,null,null,null,null,null,null,null,null,0,null,0,0,null,null,null,null,null,null,null,null,null,null,null,null,null,null,null,null,null,null,null,0,0]
[null,null,null,null,null,null,null,null,null,null,null,null,null,null,null,null,null,null,null,null,null,null,null,null,null,null,null,null,null,null,null,null,null,null,null,0,0]
[null,null,null,null,null,null,null,null,null,null,null,null,null,null,null,null,null,null,null,null,null,null,null,null,null,null,null,null,null,null,null,null,null,null,null,0,0]
[null,null,null,null,null,null,null,null,null,null,null,null,null,null,null,null,null,null,null,null,null,null,null,null,null,null,null,null,null,null,null,null,null,null,null,0,0]
[null,null,null,null,null,null,null,null,null,null,null,null,null,null,null,null,null,null,null,null,null,null,null,null,null,null,null,null,null,null,null,null,null,null,null,0,0]
[null,null,null,null,null,null,null,null,null,null,null,null,null,null,null,null,null,null,null,null,null,null,null,null,null,null,null,null,null,null,null,null,null,null,null,0,0]
[null,null,null,null,null,null,null,null,null,null,null,null,null,null,null,null,null,null,null,null,null,null,null,null,null,null,null,null,null,null,null,null,null,null,null,0,0]
[null,null,null,null,null,null,null,null,null,null,null,null,null,null,null,null,null,null,null,null,null,null,null,null,null,null,null,null,null,null,null,null,null,null,null,0,0]
[null,null,null,null,null,null,null,null,null,null,null,null,null,null,null,null,null,null,null,null,null,null,null,null,null,null,null,null,null,null,null,null,null,null,null,0,0]
[null,null,null,null,null,null,null,null,null,null,null,null,null,null,null,null,null,null,null,null,null,null,null,null,null,null,null,null,null,null,null,null,null,null,null,0,0]
[null,null,null,null,null,null,null,null,null,null,null,null,null,null,null,null,null,null,null,null,null,null,null,null,null,null,null,null,null,null,null,null,null,null,null,0,0]
[null,null,null,null,null,null,null,null,null,null,null,null,null,null,null,null,null,null,null,null,null,null,null,null,null,null,null,null,null,null,null,null,null,null,null,0,0]
[null,null,null,null,null,null,null,null,null,null,null,null,null,null,null,null,null,null,null,null,null,null,null,null,null,null,null,null,null,null,null,null,null,null,null,0,0]
[null,null,null,null,null,null,null,null,null,null,null,null,null,null,null,null,null,null,null,null,null,null,null,null,null,null,null,null,null,null,null,null,null,null,null,0,0]
[null,null,null,null,null,null,null,null,null,null,null,null,null,null,null,null,null,null,null,null,null,null,null,null,null,null,null,null,null,null,null,null,null,null,null,0,0]
[null,null,null,null,null,null,null,null,null,null,null,null,null,null,null,null,null,null,null,null,null,null,null,null,null,null,null,null,null,null,null,null,null,null,null,0,0]
[null,null,null,null,null,null,null,null,null,null,null,null,null,null,null,null,null,null,null,null,null,null,null,null,null,null,null,null,null,null,null,null,null,null,null,0,0]
[null,null,null,null,null,null,null,null,null,null,null,null,null,null,null,null,null,null,null,null,null,null,null,null,null,null,null,null,null,null,null,null,null,null,null,0,0]
[null,null,null,null,null,null,null,null,null,null,null,null,null,null,null,null,null,null,null,null,null,null,null,null,null,null,null,null,null,null,null,null,null,null,null,0,0]
[null,null,null,null,null,null,null,null,null,null,null,null,null,null,null,null,null,null,null,null,null,null,null,null,null,null,null,null,null,null,null,null,null,null,null,0,0]
[null,null,null,null,null,null,null,null,null,null,null,null,null,null,null,null,null,null,null,null,null,null,null,null,null,null,null,null,null,null,null,null,null,null,null,0,0]
[null,null,null,null,null,null,null,null,null,null,null,null,null,null,null,null,null,null,null,null,null,null,null,null,null,null,null,null,null,null,null,null,null,null,null,0,0]
[null,null,null,null,null,null,null,null,null,null,null,null,null,null,null,null,null,null,null,null,null,null,null,null,null,null,null,null,null,null,null,null,null,null,null,0,0]
[null,null,null,null,null,null,null,null,null,null,null,null,null,null,null,null,null,null,null,null,null,null,null,null,null,null,null,null,null,null,null,null,null,null,null,0,0]
[null,null,null,null,null,null,null,null,null,null,null,null,null,null,null,null,null,null,null,null,null,null,null,null,null,null,null,null,null,null,null,null,null,null,null,0,0]
[null,null,null,null,null,null,null,null,null,null,null,null,null,null,null,null,null,null,null,null,null,null,null,null,null,null,null,null,null,null,null,null,null,null,null,0,0]
[null,null,null,null,null,null,null,null,null,null,null,null,null,null,null,null,null,null,null,null,null,null,null,null,null,null,null,null,null,null,null,null,null,null,null,0,0]
[null,null,null,null,null,null,null,null,null,null,null,null,null,null,null,null,null,null,null,null,null,null,null,null,null,null,null,null,null,null,null,null,null,null,null,0,0]
[null,null,null,null,null,null,null,null,null,null,null,null,null,null,null,null,null,null,null,null,null,null,null,null,null,null,null,null,null,null,null,null,null,null,null,0,0]
[null,null,null,null,null,null,null,null,null,null,null,null,null,null,null,null,null,null,null,null,null,null,null,null,null,null,null,null,null,null,null,null,null,null,null,0,0]
[null,null,null,null,null,null,null,null,null,null,null,null,null,null,null,null,null,null,null,null,null,null,null,null,null,null,null,null,null,null,null,null,null,null,null,0,0]
[null,null,null,null,null,null,null,null,null,null,null,null,null,null,null,null,null,null,null,null,null,null,null,null,null,null,null,null,null,null,null,null,null,null,null,0,0]
[null,null,null,null,null,null,null,null,null,null,null,null,null,null,null,null,null,null,null,null,null,null,null,null,null,null,null,null,null,null,null,null,null,null,null,0,0]
[null,null,null,null,null,null,null,null,null,null,null,null,null,null,null,null,null,null,null,null,null,null,null,null,null,null,null,null,null,null,null,null,null,null,null,{"$f":"IF($AA$1 = 1, SUM(AA130:AH130),SUM(AA130:AH130)-MAX(AA130:AH130)+AI130)","v":0},{"$f":"MAX(AA130:AH130)","v":0}]
[null,null,null,null,null,null,null,null,null,null,null,null,null,null,null,null,null,null,null,null,null,null,null,null,null,null,null,null,null,null,null,null,null,null,null,0,0]
[null,null,null,null,null,null,null,null,null,null,null,null,null,null,null,null,null,null,null,null,null,null,null,null,null,null,null,null,null,null,null,null,null,null,null,0,0]
[null,null,null,null,null,null,null,null,null,null,null,null,null,null,null,null,null,null,null,null,null,null,null,null,null,null,null,null,null,null,null,null,null,null,null,0,0]
[null,null,null,null,null,null,null,null,null,null,null,null,null,null,null,null,null,null,null,null,null,null,null,null,null,null,null,null,null,null,null,null,null,null,null,0,0]
[null,null,null,null,null,null,null,null,null,null,null,null,null,null,null,null,null,null,null,null,null,null,null,null,null,null,null,null,null,null,null,null,null,null,null,0,0]
[null,null,null,null,null,null,null,null,null,null,null,null,null,null,null,null,null,null,null,null,null,null,null,null,null,null,null,null,null,null,null,null,null,null,null,0,0]
[null,null,null,null,null,null,null,null,null,null,null,null,null,null,null,null,null,null,null,null,null,null,null,null,null,null,null,null,null,null,null,null,null,null,null,0,0]
[null,null,null,null,null,null,null,null,null,null,null,null,null,null,null,null,null,null,null,null,null,null,null,null,null,null,null,null,null,null,null,null,null,null,null,0,0]
[null,null,null,null,null,null,null,null,null,null,null,null,null,null,null,null,null,null,null,null,null,null,null,null,null,null,null,null,null,null,null,null,null,null,null,0,0]
[null,null,null,null,null,null,null,null,null,null,null,null,null,null,null,null,null,null,null,null,null,null,null,null,null,null,null,null,null,null,null,null,null,null,null,0,0]
[null,null,null,null,null,null,null,null,null,null,null,null,null,null,null,null,null,null,null,null,null,null,null,null,null,null,null,null,null,null,null,null,null,null,null,0,0]
[null,null,null,null,null,null,null,null,null,null,null,null,null,null,null,null,null,null,null,null,null,null,null,null,null,null,null,null,null,null,null,null,null,null,null,0,0]
[null,null,null,null,null,null,null,null,null,null,null,null,null,null,null,null,null,null,null,null,null,null,null,null,null,null,null,null,null,null,null,null,null,null,null,0,0]
[null,null,null,null,null,null,null,null,null,null,null,null,null,null,null,null,null,null,null,null,null,null,null,null,null,null,null,null,null,null,null,null,null,null,null,0,0]
[null,null,null,null,null,null,null,null,null,null,null,null,null,null,null,null,null,null,null,null,null,null,null,null,null,null,null,null,null,null,null,null,null,null,null,0,0]
[null,null,null,null,null,null,null,null,null,null,null,null,null,null,null,null,null,null,null,null,null,null,null,null,null,null,null,null,null,null,null,null,null,null,null,0,0]
[null,null,null,null,null,null,null,null,null,null,null,null,null,null,null,null,null,null,null,null,null,null,null,null,null,null,null,null,null,null,null,null,null,null,null,0,0]
[null,null,null,null,null,null,null,null,null,null,null,null,null,null,null,null,null,null,null,null,null,null,null,null,null,null,null,null,null,null,null,null,null,null,null,0,0]
[null,null,null,null,null,null,null,null,null,null,null,null,null,null,null,null,null,null,null,null,null,null,null,null,null,null,null,null,null,null,null,null,null,null,null,0,0]
[null,null,null,null,null,null,null,null,null,null,null,null,null,null,null,null,null,null,null,null,null,null,null,null,null,null,null,null,null,null,null,null,null,null,null,0,0]
[null,null,null,null,null,null,null,null,null,null,null,null,null,null,null,null,null,null,null,null,null,null,null,null,null,null,null,null,null,null,null,null,null,null,null,0,0]

{"sheet":"Rosters","index":13,"n_rows":48,"n_cols":17,"rows_kept":48,"cut":false,"hidden":false,"merged":[]}
[null,"Wisconsin Little Ten"]
[]
["Teams"]
[1,"Beaver Dam","BD"]
[2,"Hartford","HT"]
[3,"Oconomowoc","OC"]
[4,"Slinger","SL"]
[5,"Watertown","WT"]
[6,"West Bend East","WBE"]
[7,"West Bend West","WBW"]
[8,"Wisconsin Lutheran","WL"]
[]
[]
[]
[]
[]
[]
[]
[null,{"$f":"COUNTA(team1players)","v":6},null,{"$f":"COUNTA(team2players)","v":8},null,{"$f":"COUNTA(team3players)","v":9},null,{"$f":"COUNTA(team4players)","v":12},null,{"$f":"COUNTA(team5players)","v":6},null,{"$f":"COUNTA(team6players)","v":5},null,{"$f":"COUNTA(team7players)","v":6},null,{"$f":"COUNTA(team8players)","v":6}]
["Players",{"$f":"B4","v":"Beaver Dam"},"Year",{"$f":"B5","v":"Hartford"},"Year",{"$f":"B6","v":"Oconomowoc"},"Year",{"$f":"B7","v":"Slinger"},"Year",{"$f":"B8","v":"Watertown"},"Year",{"$f":"B9","v":"West Bend East"},"Year",{"$f":"B10","v":"West Bend West"},"Year",{"$f":"B11","v":"Wisconsin Lutheran"},"Year"]
[1,"Thomas Bleich",11,"Ryan Ruona",11,"George Kneiser",11,"Austin Walsh",12,"Cameron Boyd",11,"Mitch Saari",12,"Alex Haas",12,"Zachary Stahle",12]
[2,"Koby Jones",12,"John Turchi",10,"Colin Prom",12,"Jack Burns",12,"Alex Thompson",9,"Devon Hanson",11,"Kevin Albrecht",11,"Ben Krause",12]
[3,"Carter Smith",11,"Lucas Hass",11,"Sam Hosch",12,"Tanner Schmidt",12,"Collin Travis",11,"Sam Struebing",11,"Jacob Droese",12,"Scratch #1","x"]
[4,"Jacob Smith",10,"Jake Lidwin",11,"Mark Moreseau",12,"Ryan Graunke",12,"Austin Douglas",10,"Josh Breuer",12,"Max Rohlinger",10,"Scratch #2","x"]
[5,"Cody Trotter",12,"Luke Carroll",10,"Allan Moutvic",12,"Howie Wolf",12,"Dylan Rahfaldt",9,"Brad Halverson",9,"Nick Meucci",12,"Scratch #3","x"]
[6,"Ryan Henning",11,"Adam Butler",12,"Brett Lange",12,"Joe Perry",12,"Trevor  Reierson",11,null,null,"Marvin Bateman ",11,"Brendan Hausch","10"]
[7,null,null,"Mike Vanderheiden","10","Drew Cook",11,"Bryan Laude",12]
[8,null,null,"Zak Brooks","10",null,null,"Chris Evans",11]
[9,null,null,null,null,"Joey Ploch",9,"Scott Darin",11]
[10,null,null,null,null,null,null,"Ryan Erdmann",10]
[11,null,null,null,null,null,null,"Ryan Kusek","9"]
[12,null,null,null,null," ","","Nick Gliniecki",11]
[13]
[14]
[15]
[16]
[17]
[18]
[19]
[20]
[]
[]
["Current"]
[1,1,null,0,null,0,null,1,null,0,null,1,null,0,null,2]
[2,0,null,5,null,1,null,7,null,1,null,0,null,3,null,3]
[3,4,null,4,null,8,null,0,null,2,null,3,null,1,null,0]
[4,3,null,2,null,5,null,3,null,3,null,2,null,2,null,1]
[5,2,null,7,null,4,null,10,null,5,null,4,null,4,null,5]

{"sheet":"Schedule","index":14,"n_rows":108,"n_cols":4,"rows_kept":108,"cut":false,"hidden":false,"merged":[]}
[2015,"Wisconsin Little Ten Schedule"]
[null,null,null,"Fill in schedule by typing in"]
[null,null,null," dates in shaded area."]
[null,null,null,"Do not sort."]
["Teams",null,null,"Date"]
[1,"Beaver Dam","BD","2015-05-06"]
[2,"Hartford","HT","2015-05-12"]
[3,"Oconomowoc","OC","2015-05-04"]
[4,"Slinger","SL","2015-05-13"]
[5,"Watertown","WT","2015-04-30"]
[6,"West Bend East","WBE","2015-04-27"]
[7,"West Bend West","WBW","2015-04-20"]
[8,"Wisconsin Lutheran","WL","2015-04-14"]
[9,"Conference Championship @ Horicon Hills","Conf","2015-05-20"]
[]
[null,"Rain Dates: "]
[]
[]
[]
[]
[]
[]
[]
[]
[]
[]
[]
[]
[]
[]
[]
[]
[]
[]
[]
[]
[]
[]
[]
[]
[]
[]
[]
[]
[]
[]
[]
[]
[]
[]
[]
[]
[]
[]
[]
[]
[]
[]
[]
[]
[]
[]
[]
[]
[]
[]
[]
[]
[]
[]
[]
[]
[]
[]
[]
[]
[]
[]
[]
[]
[]
[]
[]
[]
[]
[]
[]
[]
[]
[]
[]
[]
[]
[]
[]
[]
[]
[]
[]
[null,null,"WL",42108]
[null,null,"WBW",42114]
[null,null,"WBE",42121]
[null,null,"WT",42124]
[null,null,"OC",42128]
[null,null,"BD",42130]
[null,null,"HT",42136]
[null,null,"SL",42137]
[null,null,"Conf",42144]